BDBM50314647 3-amino-N-(2-chloro-5-(2-methoxyethoxy)benzyl)-N-cyclopropyl-2-(4-(3-(2,6-dichloro-4-methylphenoxy)propyl)benzyl)propanamide::CHEMBL1093287
SMILES: COCCOc1ccc(Cl)c(CN(C2CC2)C(=O)C(CN)Cc2ccc(CCCOc3c(Cl)cc(C)cc3Cl)cc2)c1
InChI Key: InChIKey=OSMJTLDDZBOMDZ-UHFFFAOYSA-N
Data: 2 IC50
Activity Spreadsheet -- Enzyme Inhibition Constant Data from BindingDB
Found 2 hits for monomerid = 50314647
Trg + Lig
Ki
nM
ΔG°
kcal/mole
IC50
nM
Kd
nM
EC50/IC50
nM
koff
s-1
kon
M-1s-1
pHTemp
°C
Renin
(Homo sapiens (Human))
BDBM50314647
(3-amino-N-(2-chloro-5-(2-methoxyethoxy)benzyl)-N-c...)
Show SMILES COCCOc1ccc(Cl)c(CN(C2CC2)C(=O)C(CN)Cc2ccc(CCCOc3c(Cl)cc(C)cc3Cl)cc2)c1
Show InChI InChI=1S/C33H39Cl3N2O4/c1-22-16-30(35)32(31(36)17-22)42-13-3-4-23-5-7-24(8-6-23)18-25(20-37)33(39)38(27-9-10-27)21-26-19-28(11-12-29(26)34)41-15-14-40-2/h5-8,11-12,16-17,19,25,27H,3-4,9-10,13-15,18,20-21,37H2,1-2H3
Reactome pathway
n/an/a 0.210n/an/an/an/a7.4n/a
Merck Frosst Centre for Therapeutic Research
Curated by ChEMBL
Assay Description
Inhibition of human recombinant renin in PBS buffer at pH 7.4
Bioorg Med Chem Lett 20: 2204-9 (2010)
Article DOI: 10.1016/j.bmcl.2010.02.036
BindingDB Entry DOI: 10.7270/Q2W37WGD
Renin
(Homo sapiens (Human))
BDBM50314647
(3-amino-N-(2-chloro-5-(2-methoxyethoxy)benzyl)-N-c...)
Show SMILES COCCOc1ccc(Cl)c(CN(C2CC2)C(=O)C(CN)Cc2ccc(CCCOc3c(Cl)cc(C)cc3Cl)cc2)c1
Show InChI InChI=1S/C33H39Cl3N2O4/c1-22-16-30(35)32(31(36)17-22)42-13-3-4-23-5-7-24(8-6-23)18-25(20-37)33(39)38(27-9-10-27)21-26-19-28(11-12-29(26)34)41-15-14-40-2/h5-8,11-12,16-17,19,25,27H,3-4,9-10,13-15,18,20-21,37H2,1-2H3
Reactome pathway
n/an/a 18n/an/an/an/an/an/a
Merck Frosst Centre for Therapeutic Research
Curated by ChEMBL
Assay Description
Inhibition of human recombinant renin in human citrated-plasma
Bioorg Med Chem Lett 20: 2204-9 (2010)
Article DOI: 10.1016/j.bmcl.2010.02.036
BindingDB Entry DOI: 10.7270/Q2W37WGD