BDBM50314897 5-methoxy-1'-(2-(pyridin-2-yl)-1H-benzo[d]imidazole-5-carbonyl)spiro[chroman-2,4'-piperidin]-4-one::CHEMBL1088921
SMILES: COc1cccc2OC3(CCN(CC3)C(=O)c3ccc4nc([nH]c4c3)-c3ccccn3)CC(=O)c12
InChI Key: InChIKey=XFQOJVQMPGVBGU-UHFFFAOYSA-N
Data: 2 IC50
Activity Spreadsheet -- Enzyme Inhibition Constant Data from BindingDB
Found 2 hits for monomerid = 50314897
Trg + Lig
Ki
nM
ΔG°
kcal/mole
IC50
nM
Kd
nM
EC50/IC50
nM
koff
s-1
kon
M-1s-1
pHTemp
°C
Acetyl-CoA carboxylase 2 (ACC2)
(Homo sapiens (Human))
BDBM50314897
(5-methoxy-1'-(2-(pyridin-2-yl)-1H-benzo[d]imidazol...)
Show SMILES COc1cccc2OC3(CCN(CC3)C(=O)c3ccc4nc([nH]c4c3)-c3ccccn3)CC(=O)c12
Show InChI InChI=1S/C27H24N4O4/c1-34-22-6-4-7-23-24(22)21(32)16-27(35-23)10-13-31(14-11-27)26(33)17-8-9-18-20(15-17)30-25(29-18)19-5-2-3-12-28-19/h2-9,12,15H,10-11,13-14,16H2,1H3,(H,29,30)
Reactome pathway
n/an/a 12n/an/an/an/an/an/a
Pfizer Global Research and Development
Curated by ChEMBL
Assay Description
Inhibition of human recombinant ACC2 expressed in CHO cells after 1 hr by fluorescence reader
Bioorg Med Chem Lett 20: 2383-8 (2010)
Article DOI: 10.1016/j.bmcl.2009.04.091
BindingDB Entry DOI: 10.7270/Q22N52DW
Acetyl-CoA carboxylase 1 (ACC1)
(Rattus norvegicus (Rat))
BDBM50314897
(5-methoxy-1'-(2-(pyridin-2-yl)-1H-benzo[d]imidazol...)
Show SMILES COc1cccc2OC3(CCN(CC3)C(=O)c3ccc4nc([nH]c4c3)-c3ccccn3)CC(=O)c12
Show InChI InChI=1S/C27H24N4O4/c1-34-22-6-4-7-23-24(22)21(32)16-27(35-23)10-13-31(14-11-27)26(33)17-8-9-18-20(15-17)30-25(29-18)19-5-2-3-12-28-19/h2-9,12,15H,10-11,13-14,16H2,1H3,(H,29,30)
n/an/a 26n/an/an/an/an/an/a
Pfizer Global Research and Development
Curated by ChEMBL
Assay Description
Inhibition of rat liver ACC1 after 7 mins by liquid scintillation counter
Bioorg Med Chem Lett 20: 2383-8 (2010)
Article DOI: 10.1016/j.bmcl.2009.04.091
BindingDB Entry DOI: 10.7270/Q22N52DW