BDBM50314990 CHEMBL1089203::N-(3-Ethynylphenyl)-6,7-bis(2-methoxyethoxy)quinolin-4-amine
SMILES: COCCOc1cc2nccc(Nc3cccc(c3)C#C)c2cc1OCCOC
InChI Key: InChIKey=ZQYQKUIFZATHRG-UHFFFAOYSA-N
Data: 3 IC50  2 Kd
Activity Spreadsheet -- Enzyme Inhibition Constant Data from BindingDB
Found 5 hits for monomerid = 50314990
Trg + Lig
Ki
nM
ΔG°
kcal/mole
IC50
nM
Kd
nM
EC50/IC50
nM
koff
s-1
kon
M-1s-1
pHTemp
°C
Epidermal growth factor receptor
(Homo sapiens (Human))
BDBM50314990
(CHEMBL1089203 | N-(3-Ethynylphenyl)-6,7-bis(2-meth...)
Show SMILES COCCOc1cc2nccc(Nc3cccc(c3)C#C)c2cc1OCCOC
Show InChI InChI=1S/C23H24N2O4/c1-4-17-6-5-7-18(14-17)25-20-8-9-24-21-16-23(29-13-11-27-3)22(15-19(20)21)28-12-10-26-2/h1,5-9,14-16H,10-13H2,2-3H3,(H,24,25)
n/an/a 30n/an/an/an/an/an/a
Chemical Genomics Centre of the Max Planck Society
Curated by ChEMBL
Assay Description
Inhibition of wild type EGFR by HTRF assay
J Med Chem 53: 2892-901 (2010)
Article DOI: 10.1021/jm901877j
BindingDB Entry DOI: 10.7270/Q2T43T7N
Epidermal growth factor receptor
(Homo sapiens (Human))
BDBM50314990
(CHEMBL1089203 | N-(3-Ethynylphenyl)-6,7-bis(2-meth...)
Show SMILES COCCOc1cc2nccc(Nc3cccc(c3)C#C)c2cc1OCCOC
Show InChI InChI=1S/C23H24N2O4/c1-4-17-6-5-7-18(14-17)25-20-8-9-24-21-16-23(29-13-11-27-3)22(15-19(20)21)28-12-10-26-2/h1,5-9,14-16H,10-13H2,2-3H3,(H,24,25)
n/an/an/a 390n/an/an/an/an/a
University of North Carolina at Chapel Hill
Curated by ChEMBL
Assay Description
Binding affinity to wild-type human partial length EGFR (R669 to V1011 residues) expressed in bacterial expression system by Kinomescan method
J Med Chem 62: 4772-4778 (2019)
Article DOI: 10.1021/acs.jmedchem.9b00350
Epidermal growth factor receptor
(Homo sapiens (Human))
BDBM50314990
(CHEMBL1089203 | N-(3-Ethynylphenyl)-6,7-bis(2-meth...)
Show SMILES COCCOc1cc2nccc(Nc3cccc(c3)C#C)c2cc1OCCOC
Show InChI InChI=1S/C23H24N2O4/c1-4-17-6-5-7-18(14-17)25-20-8-9-24-21-16-23(29-13-11-27-3)22(15-19(20)21)28-12-10-26-2/h1,5-9,14-16H,10-13H2,2-3H3,(H,24,25)
n/an/a 340n/an/an/an/an/an/a
University of North Carolina at Chapel Hill
Curated by ChEMBL
Assay Description
Inhibition of EGFR in human A431 cells assessed as reduction in EGF-stimulated EGFR autophosphorylation preincuabted for 90 mins followed by EGF-stim...
J Med Chem 62: 4772-4778 (2019)
Article DOI: 10.1021/acs.jmedchem.9b00350
Serine/threonine-protein kinase GAK
(Homo sapiens (Human))
BDBM50314990
(CHEMBL1089203 | N-(3-Ethynylphenyl)-6,7-bis(2-meth...)
Show SMILES COCCOc1cc2nccc(Nc3cccc(c3)C#C)c2cc1OCCOC
Show InChI InChI=1S/C23H24N2O4/c1-4-17-6-5-7-18(14-17)25-20-8-9-24-21-16-23(29-13-11-27-3)22(15-19(20)21)28-12-10-26-2/h1,5-9,14-16H,10-13H2,2-3H3,(H,24,25)
Reactome pathway
n/an/a 4.20E+3n/an/an/an/an/an/a
University of North Carolina at Chapel Hill
Curated by ChEMBL
Assay Description
Inhibition of tracer 5 binding to human N-terminal nano luciferase-fused GAK expressed in HEK293 cells measured after 2 hrs by nanoBRET assay
J Med Chem 62: 4772-4778 (2019)
Article DOI: 10.1021/acs.jmedchem.9b00350
Serine/threonine-protein kinase GAK
(Homo sapiens (Human))
BDBM50314990
(CHEMBL1089203 | N-(3-Ethynylphenyl)-6,7-bis(2-meth...)
Show SMILES COCCOc1cc2nccc(Nc3cccc(c3)C#C)c2cc1OCCOC
Show InChI InChI=1S/C23H24N2O4/c1-4-17-6-5-7-18(14-17)25-20-8-9-24-21-16-23(29-13-11-27-3)22(15-19(20)21)28-12-10-26-2/h1,5-9,14-16H,10-13H2,2-3H3,(H,24,25)
Reactome pathway
n/an/an/a 1.20E+3n/an/an/an/an/a
University of North Carolina at Chapel Hill
Curated by ChEMBL
Assay Description
Binding affinity to wild-type human partial length GAK (G13 to Y338 residues) expressed in bacterial expression system by Kinomescan method
J Med Chem 62: 4772-4778 (2019)
Article DOI: 10.1021/acs.jmedchem.9b00350