BDBM50315083 1-(4-(4,6-bis((R)-3-methylmorpholino)-1,3,5-triazin-2-yl)phenyl)-3-(4-(4-(dimethylamino)piperidin-1-yl)phenyl)urea::CHEMBL1092036
SMILES: C[C@@H]1COCCN1c1nc(nc(n1)-c1ccc(NC(=O)Nc2ccc(cc2)N2CCC(CC2)N(C)C)cc1)N1CCOC[C@H]1C
InChI Key: InChIKey=CRPBRHLJMIPXTQ-DNQXCXABSA-N
Data: 2 IC50
Activity Spreadsheet -- Enzyme Inhibition Constant Data from BindingDB
Found 2 hits for monomerid = 50315083
Trg + Lig
Ki
nM
ΔG°
kcal/mole
IC50
nM
Kd
nM
EC50/IC50
nM
koff
s-1
kon
M-1s-1
pHTemp
°C
Phosphatidylinositol 4,5-bisphosphate 3-kinase catalytic subunit alpha isoform
(Homo sapiens (Human))
BDBM50315083
(1-(4-(4,6-bis((R)-3-methylmorpholino)-1,3,5-triazi...)
Show SMILES C[C@@H]1COCCN1c1nc(nc(n1)-c1ccc(NC(=O)Nc2ccc(cc2)N2CCC(CC2)N(C)C)cc1)N1CCOC[C@H]1C |r|
Show InChI InChI=1S/C33H45N9O3/c1-23-21-44-19-17-41(23)31-36-30(37-32(38-31)42-18-20-45-22-24(42)2)25-5-7-26(8-6-25)34-33(43)35-27-9-11-29(12-10-27)40-15-13-28(14-16-40)39(3)4/h5-12,23-24,28H,13-22H2,1-4H3,(H2,34,35,43)/t23-,24-/m1/s1
NCI pathway
Reactome pathway
n/an/a 287n/an/an/an/an/an/a
Wyeth Research
Curated by ChEMBL
Assay Description
Inhibition of PI3Kalpha assessed as PIP3 accumulation after 24 mins by HTRF assay
Bioorg Med Chem Lett 20: 2654-7 (2010)
Article DOI: 10.1016/j.bmcl.2010.02.029
BindingDB Entry DOI: 10.7270/Q2959HQ5
Serine/threonine-protein kinase mTOR
(Rattus norvegicus)
BDBM50315083
(1-(4-(4,6-bis((R)-3-methylmorpholino)-1,3,5-triazi...)
Show SMILES C[C@@H]1COCCN1c1nc(nc(n1)-c1ccc(NC(=O)Nc2ccc(cc2)N2CCC(CC2)N(C)C)cc1)N1CCOC[C@H]1C |r|
Show InChI InChI=1S/C33H45N9O3/c1-23-21-44-19-17-41(23)31-36-30(37-32(38-31)42-18-20-45-22-24(42)2)25-5-7-26(8-6-25)34-33(43)35-27-9-11-29(12-10-27)40-15-13-28(14-16-40)39(3)4/h5-12,23-24,28H,13-22H2,1-4H3,(H2,34,35,43)/t23-,24-/m1/s1
Reactome pathway
n/an/a 1.90n/an/an/an/an/an/a
Wyeth Research
Curated by ChEMBL
Assay Description
Inhibition of rat brain mTOR assessed as p70S6k-GST protein phosphorylation after 30 mins by ELISA
Bioorg Med Chem Lett 20: 2654-7 (2010)
Article DOI: 10.1016/j.bmcl.2010.02.029
BindingDB Entry DOI: 10.7270/Q2959HQ5