BDBM50315089 (R)-1-(4-(4-(3-methylmorpholino)-6-(tetrahydro-2H-pyran-4-yl)-1,3,5-triazin-2-yl)phenyl)-3-(6-(4-methylpiperazin-1-yl)pyridin-3-yl)urea::CHEMBL1092041
SMILES: C[C@@H]1COCCN1c1nc(nc(n1)-c1ccc(NC(=O)Nc2ccc(nc2)N2CCN(C)CC2)cc1)C1CCOCC1
InChI Key: InChIKey=DZZPVIOERIZDNA-OAQYLSRUSA-N
Data: 2 IC50
Activity Spreadsheet -- Enzyme Inhibition Constant Data from BindingDB
Found 2 hits for monomerid = 50315089
Trg + Lig
Ki
nM
ΔG°
kcal/mole
IC50
nM
Kd
nM
EC50/IC50
nM
koff
s-1
kon
M-1s-1
pHTemp
°C
Phosphatidylinositol 4,5-bisphosphate 3-kinase catalytic subunit alpha isoform
(Homo sapiens (Human))
BDBM50315089
((R)-1-(4-(4-(3-methylmorpholino)-6-(tetrahydro-2H-...)
Show SMILES C[C@@H]1COCCN1c1nc(nc(n1)-c1ccc(NC(=O)Nc2ccc(nc2)N2CCN(C)CC2)cc1)C1CCOCC1 |r|
Show InChI InChI=1S/C30H39N9O3/c1-21-20-42-18-15-39(21)29-35-27(34-28(36-29)23-9-16-41-17-10-23)22-3-5-24(6-4-22)32-30(40)33-25-7-8-26(31-19-25)38-13-11-37(2)12-14-38/h3-8,19,21,23H,9-18,20H2,1-2H3,(H2,32,33,40)/t21-/m1/s1
NCI pathway
Reactome pathway
n/an/a 220n/an/an/an/an/an/a
Wyeth Research
Curated by ChEMBL
Assay Description
Inhibition of PI3Kalpha assessed as PIP3 accumulation after 24 mins by HTRF assay
Bioorg Med Chem Lett 20: 2654-7 (2010)
Article DOI: 10.1016/j.bmcl.2010.02.029
BindingDB Entry DOI: 10.7270/Q2959HQ5
Serine/threonine-protein kinase mTOR
(Rattus norvegicus)
BDBM50315089
((R)-1-(4-(4-(3-methylmorpholino)-6-(tetrahydro-2H-...)
Show SMILES C[C@@H]1COCCN1c1nc(nc(n1)-c1ccc(NC(=O)Nc2ccc(nc2)N2CCN(C)CC2)cc1)C1CCOCC1 |r|
Show InChI InChI=1S/C30H39N9O3/c1-21-20-42-18-15-39(21)29-35-27(34-28(36-29)23-9-16-41-17-10-23)22-3-5-24(6-4-22)32-30(40)33-25-7-8-26(31-19-25)38-13-11-37(2)12-14-38/h3-8,19,21,23H,9-18,20H2,1-2H3,(H2,32,33,40)/t21-/m1/s1
Reactome pathway
n/an/a 2.30n/an/an/an/an/an/a
Wyeth Research
Curated by ChEMBL
Assay Description
Inhibition of rat brain mTOR assessed as p70S6k-GST protein phosphorylation after 30 mins by ELISA
Bioorg Med Chem Lett 20: 2654-7 (2010)
Article DOI: 10.1016/j.bmcl.2010.02.029
BindingDB Entry DOI: 10.7270/Q2959HQ5