BDBM50315097 1-(4-(4,6-bis((R)-3-methylmorpholino)-1,3,5-triazin-2-yl)phenyl)-3-(pyridin-4-yl)urea::CHEMBL1093181
SMILES: C[C@@H]1COCCN1c1nc(nc(n1)-c1ccc(NC(=O)Nc2ccncc2)cc1)N1CCOC[C@H]1C
InChI Key: InChIKey=XLIAJTYUKXFSJS-QZTJIDSGSA-N
Data: 2 IC50
Activity Spreadsheet -- Enzyme Inhibition Constant Data from BindingDB
Found 2 hits for monomerid = 50315097
Trg + Lig
Ki
nM
ΔG°
kcal/mole
IC50
nM
Kd
nM
EC50/IC50
nM
koff
s-1
kon
M-1s-1
pHTemp
°C
Phosphatidylinositol 4,5-bisphosphate 3-kinase catalytic subunit alpha isoform
(Homo sapiens (Human))
BDBM50315097
(1-(4-(4,6-bis((R)-3-methylmorpholino)-1,3,5-triazi...)
Show SMILES C[C@@H]1COCCN1c1nc(nc(n1)-c1ccc(NC(=O)Nc2ccncc2)cc1)N1CCOC[C@H]1C |r|
Show InChI InChI=1S/C25H30N8O3/c1-17-15-35-13-11-32(17)23-29-22(30-24(31-23)33-12-14-36-16-18(33)2)19-3-5-20(6-4-19)27-25(34)28-21-7-9-26-10-8-21/h3-10,17-18H,11-16H2,1-2H3,(H2,26,27,28,34)/t17-,18-/m1/s1
NCI pathway
Reactome pathway
n/an/a 173n/an/an/an/an/an/a
Wyeth Research
Curated by ChEMBL
Assay Description
Inhibition of PI3Kalpha assessed as PIP3 accumulation after 24 mins by HTRF assay
Bioorg Med Chem Lett 20: 2654-7 (2010)
Article DOI: 10.1016/j.bmcl.2010.02.029
BindingDB Entry DOI: 10.7270/Q2959HQ5
Serine/threonine-protein kinase mTOR
(Rattus norvegicus)
BDBM50315097
(1-(4-(4,6-bis((R)-3-methylmorpholino)-1,3,5-triazi...)
Show SMILES C[C@@H]1COCCN1c1nc(nc(n1)-c1ccc(NC(=O)Nc2ccncc2)cc1)N1CCOC[C@H]1C |r|
Show InChI InChI=1S/C25H30N8O3/c1-17-15-35-13-11-32(17)23-29-22(30-24(31-23)33-12-14-36-16-18(33)2)19-3-5-20(6-4-19)27-25(34)28-21-7-9-26-10-8-21/h3-10,17-18H,11-16H2,1-2H3,(H2,26,27,28,34)/t17-,18-/m1/s1
Reactome pathway
n/an/a 0.200n/an/an/an/an/an/a
Wyeth Research
Curated by ChEMBL
Assay Description
Inhibition of rat brain mTOR assessed as p70S6k-GST protein phosphorylation after 30 mins by ELISA
Bioorg Med Chem Lett 20: 2654-7 (2010)
Article DOI: 10.1016/j.bmcl.2010.02.029
BindingDB Entry DOI: 10.7270/Q2959HQ5