BDBM50315214 3,3'-(6-(2-(difluoromethyl)-1H-benzo[d]imidazol-1-yl)-1,3,5-triazine-2,4-diyl)bis(8-oxa-3-azabicyclo[3.2.1]octane)::CHEMBL1088919
SMILES: FC(F)c1nc2ccccc2n1-c1nc(nc(n1)N1CC2CCC(C1)O2)N1CC2CCC(C1)O2
InChI Key: InChIKey=QHOFEIMPDKZGDB-UHFFFAOYSA-N
Data: 1 IC50
Activity Spreadsheet -- Enzyme Inhibition Constant Data from BindingDB
Found 1 hit for monomerid = 50315214
Trg + Lig
Ki
nM
ΔG°
kcal/mole
IC50
nM
Kd
nM
EC50/IC50
nM
koff
s-1
kon
M-1s-1
pHTemp
°C
Serine/threonine-protein kinase mTOR
(Rattus norvegicus)
BDBM50315214
(3,3'-(6-(2-(difluoromethyl)-1H-benzo[d]imidazol-1-...)
Show SMILES FC(F)c1nc2ccccc2n1-c1nc(nc(n1)N1CC2CCC(C1)O2)N1CC2CCC(C1)O2 |TLB:16:18:25:21.22,14:26:33:29.30|
Show InChI InChI=1S/C23H25F2N7O2/c24-19(25)20-26-17-3-1-2-4-18(17)32(20)23-28-21(30-9-13-5-6-14(10-30)33-13)27-22(29-23)31-11-15-7-8-16(12-31)34-15/h1-4,13-16,19H,5-12H2
Reactome pathway
n/an/a 44n/an/an/an/an/an/a
Wyeth Research
Curated by ChEMBL
Assay Description
Inhibition of rat brain mTOR assessed as p70S6K-GST protein phosphorylation after 30 mins by ELISA
Bioorg Med Chem Lett 20: 2644-7 (2010)
Article DOI: 10.1016/j.bmcl.2010.02.045
BindingDB Entry DOI: 10.7270/Q2HQ402X