BDBM50315239 1-morpholino-2-(4-(3-(3,4,5-trimethoxyphenyl)quinoxalin-5-yl)phenyl)ethanone::CHEMBL1093191
SMILES: COc1cc(cc(OC)c1OC)-c1cnc2cccc(-c3ccc(CC(=O)N4CCOCC4)cc3)c2n1
InChI Key: InChIKey=MXIOGEZGIZYSII-UHFFFAOYSA-N
Data: 4 IC50
Activity Spreadsheet -- Enzyme Inhibition Constant Data from BindingDB
Found 4 hits for monomerid = 50315239
Trg + Lig
Ki
nM
ΔG°
kcal/mole
IC50
nM
Kd
nM
EC50/IC50
nM
koff
s-1
kon
M-1s-1
pHTemp
°C
Tyrosine-protein kinase JAK1
(Homo sapiens (Human))
BDBM50315239
(1-morpholino-2-(4-(3-(3,4,5-trimethoxyphenyl)quino...)
Show SMILES COc1cc(cc(OC)c1OC)-c1cnc2cccc(-c3ccc(CC(=O)N4CCOCC4)cc3)c2n1
Show InChI InChI=1S/C29H29N3O5/c1-34-25-16-21(17-26(35-2)29(25)36-3)24-18-30-23-6-4-5-22(28(23)31-24)20-9-7-19(8-10-20)15-27(33)32-11-13-37-14-12-32/h4-10,16-18H,11-15H2,1-3H3
Reactome pathway
n/an/a 91n/an/an/an/an/an/a
Novartis Institutes for Biomedical Research
Curated by ChEMBL
Assay Description
Inhibition of recombinant GST tagged JAK1 protein after 60 mins using FITC-Ahx-KKSRGDYMTMQIG-NH2 substrate
Bioorg Med Chem Lett 20: 2609-13 (2010)
Article DOI: 10.1016/j.bmcl.2010.02.056
BindingDB Entry DOI: 10.7270/Q2862GKB
Non-receptor tyrosine-protein kinase TYK2
(Homo sapiens (Human))
BDBM50315239
(1-morpholino-2-(4-(3-(3,4,5-trimethoxyphenyl)quino...)
Show SMILES COc1cc(cc(OC)c1OC)-c1cnc2cccc(-c3ccc(CC(=O)N4CCOCC4)cc3)c2n1
Show InChI InChI=1S/C29H29N3O5/c1-34-25-16-21(17-26(35-2)29(25)36-3)24-18-30-23-6-4-5-22(28(23)31-24)20-9-7-19(8-10-20)15-27(33)32-11-13-37-14-12-32/h4-10,16-18H,11-15H2,1-3H3
n/an/a 640n/an/an/an/an/an/a
Novartis Institutes for Biomedical Research
Curated by ChEMBL
Assay Description
Inhibition of recombinant GST tagged TYK2 protein after 60 mins using FITC-Ahx-KKSRGDYMTMQIG-NH2 substrate
Bioorg Med Chem Lett 20: 2609-13 (2010)
Article DOI: 10.1016/j.bmcl.2010.02.056
BindingDB Entry DOI: 10.7270/Q2862GKB
Tyrosine-protein kinase JAK3
(Homo sapiens (Human))
BDBM50315239
(1-morpholino-2-(4-(3-(3,4,5-trimethoxyphenyl)quino...)
Show SMILES COc1cc(cc(OC)c1OC)-c1cnc2cccc(-c3ccc(CC(=O)N4CCOCC4)cc3)c2n1
Show InChI InChI=1S/C29H29N3O5/c1-34-25-16-21(17-26(35-2)29(25)36-3)24-18-30-23-6-4-5-22(28(23)31-24)20-9-7-19(8-10-20)15-27(33)32-11-13-37-14-12-32/h4-10,16-18H,11-15H2,1-3H3
Reactome pathway
n/an/a 1.30E+3n/an/an/an/an/an/a
Novartis Institutes for Biomedical Research
Curated by ChEMBL
Assay Description
Inhibition of recombinant GST tagged JAK3 protein after 60 mins using FITC-GGEEEEYFELVKKKK-NH2 substrate
Bioorg Med Chem Lett 20: 2609-13 (2010)
Article DOI: 10.1016/j.bmcl.2010.02.056
BindingDB Entry DOI: 10.7270/Q2862GKB
Tyrosine-protein kinase JAK2
(Homo sapiens (Human))
BDBM50315239
(1-morpholino-2-(4-(3-(3,4,5-trimethoxyphenyl)quino...)
Show SMILES COc1cc(cc(OC)c1OC)-c1cnc2cccc(-c3ccc(CC(=O)N4CCOCC4)cc3)c2n1
Show InChI InChI=1S/C29H29N3O5/c1-34-25-16-21(17-26(35-2)29(25)36-3)24-18-30-23-6-4-5-22(28(23)31-24)20-9-7-19(8-10-20)15-27(33)32-11-13-37-14-12-32/h4-10,16-18H,11-15H2,1-3H3
Reactome pathway
n/an/a 13n/an/an/an/an/an/a
Novartis Institutes for Biomedical Research
Curated by ChEMBL
Assay Description
Inhibition of recombinant GST tagged JAK2 protein after 60 mins using FITC-GGEEEEYFELVKKKK-NH2 substrate
Bioorg Med Chem Lett 20: 2609-13 (2010)
Article DOI: 10.1016/j.bmcl.2010.02.056
BindingDB Entry DOI: 10.7270/Q2862GKB