BDBM50315247 (2-methyl-4-(3-(3,4,5-trimethoxyphenyl)quinoxalin-5-yl)phenyl)(morpholino)methanone::CHEMBL1088856
SMILES: COc1cc(cc(OC)c1OC)-c1cnc2cccc(-c3ccc(C(=O)N4CCOCC4)c(C)c3)c2n1
InChI Key: InChIKey=BUNXZYXBVGVIPQ-UHFFFAOYSA-N
Data: 4 IC50
Activity Spreadsheet -- Enzyme Inhibition Constant Data from BindingDB
Found 4 hits for monomerid = 50315247
Trg + Lig
Ki
nM
ΔG°
kcal/mole
IC50
nM
Kd
nM
EC50/IC50
nM
koff
s-1
kon
M-1s-1
pHTemp
°C
Tyrosine-protein kinase JAK1
(Homo sapiens (Human))
BDBM50315247
((2-methyl-4-(3-(3,4,5-trimethoxyphenyl)quinoxalin-...)
Show SMILES COc1cc(cc(OC)c1OC)-c1cnc2cccc(-c3ccc(C(=O)N4CCOCC4)c(C)c3)c2n1
Show InChI InChI=1S/C29H29N3O5/c1-18-14-19(8-9-21(18)29(33)32-10-12-37-13-11-32)22-6-5-7-23-27(22)31-24(17-30-23)20-15-25(34-2)28(36-4)26(16-20)35-3/h5-9,14-17H,10-13H2,1-4H3
Reactome pathway
n/an/a 460n/an/an/an/an/an/a
Novartis Institutes for Biomedical Research
Curated by ChEMBL
Assay Description
Inhibition of recombinant GST tagged JAK1 protein after 60 mins using FITC-Ahx-KKSRGDYMTMQIG-NH2 substrate
Bioorg Med Chem Lett 20: 2609-13 (2010)
Article DOI: 10.1016/j.bmcl.2010.02.056
BindingDB Entry DOI: 10.7270/Q2862GKB
Non-receptor tyrosine-protein kinase TYK2
(Homo sapiens (Human))
BDBM50315247
((2-methyl-4-(3-(3,4,5-trimethoxyphenyl)quinoxalin-...)
Show SMILES COc1cc(cc(OC)c1OC)-c1cnc2cccc(-c3ccc(C(=O)N4CCOCC4)c(C)c3)c2n1
Show InChI InChI=1S/C29H29N3O5/c1-18-14-19(8-9-21(18)29(33)32-10-12-37-13-11-32)22-6-5-7-23-27(22)31-24(17-30-23)20-15-25(34-2)28(36-4)26(16-20)35-3/h5-9,14-17H,10-13H2,1-4H3
n/an/a 1.40E+3n/an/an/an/an/an/a
Novartis Institutes for Biomedical Research
Curated by ChEMBL
Assay Description
Inhibition of recombinant GST tagged TYK2 protein after 60 mins using FITC-Ahx-KKSRGDYMTMQIG-NH2 substrate
Bioorg Med Chem Lett 20: 2609-13 (2010)
Article DOI: 10.1016/j.bmcl.2010.02.056
BindingDB Entry DOI: 10.7270/Q2862GKB
Tyrosine-protein kinase JAK3
(Homo sapiens (Human))
BDBM50315247
((2-methyl-4-(3-(3,4,5-trimethoxyphenyl)quinoxalin-...)
Show SMILES COc1cc(cc(OC)c1OC)-c1cnc2cccc(-c3ccc(C(=O)N4CCOCC4)c(C)c3)c2n1
Show InChI InChI=1S/C29H29N3O5/c1-18-14-19(8-9-21(18)29(33)32-10-12-37-13-11-32)22-6-5-7-23-27(22)31-24(17-30-23)20-15-25(34-2)28(36-4)26(16-20)35-3/h5-9,14-17H,10-13H2,1-4H3
Reactome pathway
n/an/a 1.50E+3n/an/an/an/an/an/a
Novartis Institutes for Biomedical Research
Curated by ChEMBL
Assay Description
Inhibition of recombinant GST tagged JAK3 protein after 60 mins using FITC-GGEEEEYFELVKKKK-NH2 substrate
Bioorg Med Chem Lett 20: 2609-13 (2010)
Article DOI: 10.1016/j.bmcl.2010.02.056
BindingDB Entry DOI: 10.7270/Q2862GKB
Tyrosine-protein kinase JAK2
(Homo sapiens (Human))
BDBM50315247
((2-methyl-4-(3-(3,4,5-trimethoxyphenyl)quinoxalin-...)
Show SMILES COc1cc(cc(OC)c1OC)-c1cnc2cccc(-c3ccc(C(=O)N4CCOCC4)c(C)c3)c2n1
Show InChI InChI=1S/C29H29N3O5/c1-18-14-19(8-9-21(18)29(33)32-10-12-37-13-11-32)22-6-5-7-23-27(22)31-24(17-30-23)20-15-25(34-2)28(36-4)26(16-20)35-3/h5-9,14-17H,10-13H2,1-4H3
Reactome pathway
n/an/a 20n/an/an/an/an/an/a
Novartis Institutes for Biomedical Research
Curated by ChEMBL
Assay Description
Inhibition of recombinant GST tagged JAK2 protein after 60 mins using FITC-GGEEEEYFELVKKKK-NH2 substrate
Bioorg Med Chem Lett 20: 2609-13 (2010)
Article DOI: 10.1016/j.bmcl.2010.02.056
BindingDB Entry DOI: 10.7270/Q2862GKB