BDBM50315323 (R)-1-(8-chlorobenzofuro[3,2-d]pyrimidin-4-yl)-N-methylpyrrolidin-3-amine::CHEMBL1090190
SMILES: CN[C@@H]1CCN(C1)c1ncnc2c3cc(Cl)ccc3oc12
InChI Key: InChIKey=FPSQDZNIPDQGKA-SNVBAGLBSA-N
Data: 2 IC50
Activity Spreadsheet -- Enzyme Inhibition Constant Data from BindingDB
Found 2 hits for monomerid = 50315323
Trg + Lig
Ki
nM
ΔG°
kcal/mole
IC50
nM
Kd
nM
EC50/IC50
nM
koff
s-1
kon
M-1s-1
pHTemp
°C
Histamine H4 receptor
(Homo sapiens (Human))
BDBM50315323
((R)-1-(8-chlorobenzofuro[3,2-d]pyrimidin-4-yl)-N-m...)
Show SMILES CN[C@@H]1CCN(C1)c1ncnc2c3cc(Cl)ccc3oc12 |r|
Show InChI InChI=1S/C15H15ClN4O/c1-17-10-4-5-20(7-10)15-14-13(18-8-19-15)11-6-9(16)2-3-12(11)21-14/h2-3,6,8,10,17H,4-5,7H2,1H3/t10-/m1/s1
Reactome pathway
n/an/a 41n/an/an/an/an/an/a
Argenta Discovery Ltd.
Curated by ChEMBL
Assay Description
Inverse agonist activity at human histamine H4 receptor assessed as inhibition of [35S]GTPgammaS binding after 15 mins by scintillation proximity ass...
Bioorg Med Chem Lett 20: 2516-9 (2010)
Article DOI: 10.1016/j.bmcl.2010.02.097
BindingDB Entry DOI: 10.7270/Q2CN74V3
Histamine H4 receptor
(Homo sapiens (Human))
BDBM50315323
((R)-1-(8-chlorobenzofuro[3,2-d]pyrimidin-4-yl)-N-m...)
Show SMILES CN[C@@H]1CCN(C1)c1ncnc2c3cc(Cl)ccc3oc12 |r|
Show InChI InChI=1S/C15H15ClN4O/c1-17-10-4-5-20(7-10)15-14-13(18-8-19-15)11-6-9(16)2-3-12(11)21-14/h2-3,6,8,10,17H,4-5,7H2,1H3/t10-/m1/s1
Reactome pathway
n/an/a 33n/an/an/an/an/an/a
Argenta Discovery Ltd.
Curated by ChEMBL
Assay Description
Displacement of [3H]histamine dihydrochloride from human histamine H4 receptor after 2.5 hrs by scintillation proximity assay
Bioorg Med Chem Lett 20: 2516-9 (2010)
Article DOI: 10.1016/j.bmcl.2010.02.097
BindingDB Entry DOI: 10.7270/Q2CN74V3