BDBM50315328 8-chloro-4-(tetrahydro-1H-pyrrolo[3,4-b]pyridin-6(2H,7H,7aH)-yl)benzofuro[3,2-d]pyrimidine::CHEMBL1090520
SMILES: Clc1ccc2oc3c(ncnc3c2c1)N1CC2CCCNC2C1
InChI Key: InChIKey=LAGRKYBBNRXFND-UHFFFAOYSA-N
Data: 1 IC50
Activity Spreadsheet -- Enzyme Inhibition Constant Data from BindingDB
Found 1 hit for monomerid = 50315328
Trg + Lig
Ki
nM
ΔG°
kcal/mole
IC50
nM
Kd
nM
EC50/IC50
nM
koff
s-1
kon
M-1s-1
pHTemp
°C
Histamine H4 receptor
(Homo sapiens (Human))
BDBM50315328
(8-chloro-4-(tetrahydro-1H-pyrrolo[3,4-b]pyridin-6(...)
Show SMILES Clc1ccc2oc3c(ncnc3c2c1)N1CC2CCCNC2C1
Show InChI InChI=1S/C17H17ClN4O/c18-11-3-4-14-12(6-11)15-16(23-14)17(21-9-20-15)22-7-10-2-1-5-19-13(10)8-22/h3-4,6,9-10,13,19H,1-2,5,7-8H2
Reactome pathway
n/an/a 1.40E+3n/an/an/an/an/an/a
Argenta Discovery Ltd.
Curated by ChEMBL
Assay Description
Displacement of [3H]histamine dihydrochloride from human histamine H4 receptor after 2.5 hrs by scintillation proximity assay
Bioorg Med Chem Lett 20: 2516-9 (2010)
Article DOI: 10.1016/j.bmcl.2010.02.097
BindingDB Entry DOI: 10.7270/Q2CN74V3