BDBM50315339 8-chloro-2-methyl-4-(4-methylpiperazin-1-yl)benzofuro[3,2-d]pyrimidine::CHEMBL1091558
SMILES: CN1CCN(CC1)c1nc(C)nc2c3cc(Cl)ccc3oc12
InChI Key: InChIKey=GUJLUPNSRRNJKP-UHFFFAOYSA-N
Data: 1 IC50
Activity Spreadsheet -- Enzyme Inhibition Constant Data from BindingDB
Found 1 hit for monomerid = 50315339
Trg + Lig
Ki
nM
ΔG°
kcal/mole
IC50
nM
Kd
nM
EC50/IC50
nM
koff
s-1
kon
M-1s-1
pHTemp
°C
Histamine H4 receptor
(Homo sapiens (Human))
BDBM50315339
(8-chloro-2-methyl-4-(4-methylpiperazin-1-yl)benzof...)
Show SMILES CN1CCN(CC1)c1nc(C)nc2c3cc(Cl)ccc3oc12
Show InChI InChI=1S/C16H17ClN4O/c1-10-18-14-12-9-11(17)3-4-13(12)22-15(14)16(19-10)21-7-5-20(2)6-8-21/h3-4,9H,5-8H2,1-2H3
Reactome pathway
n/an/a 37n/an/an/an/an/an/a
Argenta Discovery Ltd.
Curated by ChEMBL
Assay Description
Displacement of [3H]histamine dihydrochloride from human histamine H4 receptor after 2.5 hrs by scintillation proximity assay
Bioorg Med Chem Lett 20: 2516-9 (2010)
Article DOI: 10.1016/j.bmcl.2010.02.097
BindingDB Entry DOI: 10.7270/Q2CN74V3