BDBM50315340 1-(8-chloro-2-methylbenzofuro[3,2-d]pyrimidin-4-yl)-N-methylpyrrolidin-3-amine::CHEMBL1091559
SMILES: CNC1CCN(C1)c1nc(C)nc2c3cc(Cl)ccc3oc12
InChI Key: InChIKey=LEKUKUAFQPDYQL-UHFFFAOYSA-N
Data: 1 IC50
Activity Spreadsheet -- Enzyme Inhibition Constant Data from BindingDB
Found 1 hit for monomerid = 50315340
Trg + Lig
Ki
nM
ΔG°
kcal/mole
IC50
nM
Kd
nM
EC50/IC50
nM
koff
s-1
kon
M-1s-1
pHTemp
°C
Histamine H4 receptor
(Homo sapiens (Human))
BDBM50315340
(1-(8-chloro-2-methylbenzofuro[3,2-d]pyrimidin-4-yl...)
Show SMILES CNC1CCN(C1)c1nc(C)nc2c3cc(Cl)ccc3oc12
Show InChI InChI=1S/C16H17ClN4O/c1-9-19-14-12-7-10(17)3-4-13(12)22-15(14)16(20-9)21-6-5-11(8-21)18-2/h3-4,7,11,18H,5-6,8H2,1-2H3
Reactome pathway
n/an/a 1.60E+3n/an/an/an/an/an/a
Argenta Discovery Ltd.
Curated by ChEMBL
Assay Description
Displacement of [3H]histamine dihydrochloride from human histamine H4 receptor after 2.5 hrs by scintillation proximity assay
Bioorg Med Chem Lett 20: 2516-9 (2010)
Article DOI: 10.1016/j.bmcl.2010.02.097
BindingDB Entry DOI: 10.7270/Q2CN74V3