BDBM50315360 CHEMBL1092256::benzyl 1-acetyl-2-(4-chlorobenzyl)pyrrolidine-2-carboxylate
SMILES: CC(=O)N1CCCC1(Cc1ccc(Cl)cc1)C(=O)OCc1ccccc1
InChI Key: InChIKey=JFJYCQYCQYPTAV-UHFFFAOYSA-N
Data: 1 IC50
Activity Spreadsheet -- Enzyme Inhibition Constant Data from BindingDB
Found 1 hit for monomerid = 50315360
Trg + Lig
Ki
nM
ΔG°
kcal/mole
IC50
nM
Kd
nM
EC50/IC50
nM
koff
s-1
kon
M-1s-1
pHTemp
°C
Solute carrier family 12 member 5
(Rattus norvegicus)
BDBM50315360
(CHEMBL1092256 | benzyl 1-acetyl-2-(4-chlorobenzyl)...)
Show SMILES CC(=O)N1CCCC1(Cc1ccc(Cl)cc1)C(=O)OCc1ccccc1
Show InChI InChI=1S/C21H22ClNO3/c1-16(24)23-13-5-12-21(23,14-17-8-10-19(22)11-9-17)20(25)26-15-18-6-3-2-4-7-18/h2-4,6-11H,5,12-15H2,1H3
n/an/a 320n/an/an/an/an/an/a
UCB Pharma SA
Curated by ChEMBL
Assay Description
Antagonist activity of rat KCC2 transporter expressed in human SK-Hep cells assessed as inhibition of N-ethylmaleimide-mediated Rb+ influx after 10 m...
Bioorg Med Chem Lett 20: 2542-5 (2010)
Article DOI: 10.1016/j.bmcl.2010.02.092
BindingDB Entry DOI: 10.7270/Q2BZ665C