BDBM50315365 CHEMBL1092338::benzyl 1-acetyl-2-(3-(methylsulfonyl)benzyl)pyrrolidine-2-carboxylate
SMILES: CC(=O)N1CCCC1(Cc1cccc(c1)S(C)(=O)=O)C(=O)OCc1ccccc1
InChI Key: InChIKey=HJCRYMYFOUCOGQ-UHFFFAOYSA-N
Data: 1 IC50
Activity Spreadsheet -- Enzyme Inhibition Constant Data from BindingDB
Found 1 hit for monomerid = 50315365
Trg + Lig
Ki
nM
ΔG°
kcal/mole
IC50
nM
Kd
nM
EC50/IC50
nM
koff
s-1
kon
M-1s-1
pHTemp
°C
Solute carrier family 12 member 5
(Rattus norvegicus)
BDBM50315365
(CHEMBL1092338 | benzyl 1-acetyl-2-(3-(methylsulfon...)
Show SMILES CC(=O)N1CCCC1(Cc1cccc(c1)S(C)(=O)=O)C(=O)OCc1ccccc1
Show InChI InChI=1S/C22H25NO5S/c1-17(24)23-13-7-12-22(23,21(25)28-16-18-8-4-3-5-9-18)15-19-10-6-11-20(14-19)29(2,26)27/h3-6,8-11,14H,7,12-13,15-16H2,1-2H3
n/an/a 250n/an/an/an/an/an/a
UCB Pharma SA
Curated by ChEMBL
Assay Description
Antagonist activity of rat KCC2 transporter expressed in human SK-Hep cells assessed as inhibition of N-ethylmaleimide-mediated Rb+ influx after 10 m...
Bioorg Med Chem Lett 20: 2542-5 (2010)
Article DOI: 10.1016/j.bmcl.2010.02.092
BindingDB Entry DOI: 10.7270/Q2BZ665C