BDBM50315366 CHEMBL1092661::benzyl 1-acetyl-2-(3-(trifluoromethyl)benzyl)pyrrolidine-2-carboxylate
SMILES: CC(=O)N1CCCC1(Cc1cccc(c1)C(F)(F)F)C(=O)OCc1ccccc1
InChI Key: InChIKey=KZMHJOHYFXEQCA-UHFFFAOYSA-N
Data: 1 IC50
Activity Spreadsheet -- Enzyme Inhibition Constant Data from BindingDB
Found 1 hit for monomerid = 50315366
Trg + Lig
Ki
nM
ΔG°
kcal/mole
IC50
nM
Kd
nM
EC50/IC50
nM
koff
s-1
kon
M-1s-1
pHTemp
°C
Solute carrier family 12 member 5
(Rattus norvegicus)
BDBM50315366
(CHEMBL1092661 | benzyl 1-acetyl-2-(3-(trifluoromet...)
Show SMILES CC(=O)N1CCCC1(Cc1cccc(c1)C(F)(F)F)C(=O)OCc1ccccc1
Show InChI InChI=1S/C22H22F3NO3/c1-16(27)26-12-6-11-21(26,20(28)29-15-17-7-3-2-4-8-17)14-18-9-5-10-19(13-18)22(23,24)25/h2-5,7-10,13H,6,11-12,14-15H2,1H3
n/an/a 80n/an/an/an/an/an/a
UCB Pharma SA
Curated by ChEMBL
Assay Description
Antagonist activity of rat KCC2 transporter expressed in human SK-Hep cells assessed as inhibition of N-ethylmaleimide-mediated Rb+ influx after 10 m...
Bioorg Med Chem Lett 20: 2542-5 (2010)
Article DOI: 10.1016/j.bmcl.2010.02.092
BindingDB Entry DOI: 10.7270/Q2BZ665C