null
SMILES: CCC12CN(Cc3ccc4cc5C[C@@]6(Cc5cc4n3)N(C)C(=O)NC6=O)c3cccc(NC(=O)C1)c23
InChI Key: InChIKey=YTNSSBQNYOFYGN-CPRJBALCSA-N
Activity Spreadsheet -- Enzyme Inhibition Constant Data from BindingDB
Found 3 hits for monomerid = 50315408
Trg + Lig
Ki
nM
ΔG°
kcal/mole
IC50
nM
Kd
nM
EC50/IC50
nM
koff
s-1
kon
M-1s-1
pHTemp
°C
Calcitonin gene-related peptide type 1 receptor
(Homo sapiens (Human))
BDBM50315408
((4'S)-2-((2a-ethyl-4-oxo-2a,3,4,5-tetrahydropyrrol...)
Show SMILES CCC12CN(Cc3ccc4cc5C[C@@]6(Cc5cc4n3)N(C)C(=O)NC6=O)c3cccc(NC(=O)C1)c23 |r|
Show InChI InChI=1S/C28H27N5O3/c1-3-27-13-23(34)30-20-5-4-6-22(24(20)27)33(15-27)14-19-8-7-16-9-17-11-28(12-18(17)10-21(16)29-19)25(35)31-26(36)32(28)2/h4-10H,3,11-15H2,1-2H3,(H,30,34)(H,31,35,36)/t27?,28-/m0/s1
1.30n/an/an/an/an/an/an/an/a
Merck& Co.
Curated by ChEMBL
Assay Description
Displacement of [125I]human CLR from human CGRP expressed in HEK293 cells coexpressing human RAMP1
Bioorg Med Chem Lett 20: 2572-6 (2010)
Article DOI: 10.1016/j.bmcl.2010.02.086
BindingDB Entry DOI: 10.7270/Q2765FFZ
Calcitonin gene-related peptide type 1 receptor
(Homo sapiens (Human))
BDBM50315408
((4'S)-2-((2a-ethyl-4-oxo-2a,3,4,5-tetrahydropyrrol...)
Show SMILES CCC12CN(Cc3ccc4cc5C[C@@]6(Cc5cc4n3)N(C)C(=O)NC6=O)c3cccc(NC(=O)C1)c23 |r|
Show InChI InChI=1S/C28H27N5O3/c1-3-27-13-23(34)30-20-5-4-6-22(24(20)27)33(15-27)14-19-8-7-16-9-17-11-28(12-18(17)10-21(16)29-19)25(35)31-26(36)32(28)2/h4-10H,3,11-15H2,1-2H3,(H,30,34)(H,31,35,36)/t27?,28-/m0/s1
n/an/a 44n/an/an/an/an/an/a
Merck& Co.
Curated by ChEMBL
Assay Description
Antagonist activity at human CLR expressed in human HEK293 cells coexpressing human RAMP1 assessed as Inhibition of CGRP-induced cAMP production in t...
Bioorg Med Chem Lett 20: 2572-6 (2010)
Article DOI: 10.1016/j.bmcl.2010.02.086
BindingDB Entry DOI: 10.7270/Q2765FFZ
Calcitonin gene-related peptide type 1 receptor
(Homo sapiens (Human))
BDBM50315408
((4'S)-2-((2a-ethyl-4-oxo-2a,3,4,5-tetrahydropyrrol...)
Show SMILES CCC12CN(Cc3ccc4cc5C[C@@]6(Cc5cc4n3)N(C)C(=O)NC6=O)c3cccc(NC(=O)C1)c23 |r|
Show InChI InChI=1S/C28H27N5O3/c1-3-27-13-23(34)30-20-5-4-6-22(24(20)27)33(15-27)14-19-8-7-16-9-17-11-28(12-18(17)10-21(16)29-19)25(35)31-26(36)32(28)2/h4-10H,3,11-15H2,1-2H3,(H,30,34)(H,31,35,36)/t27?,28-/m0/s1
n/an/a 7.20n/an/an/an/an/an/a
Merck& Co.
Curated by ChEMBL
Assay Description
Antagonist activity at human CLR expressed in human HEK293 cells coexpressing human RAMP1 assessed as Inhibition of CGRP-induced cAMP production
Bioorg Med Chem Lett 20: 2572-6 (2010)
Article DOI: 10.1016/j.bmcl.2010.02.086
BindingDB Entry DOI: 10.7270/Q2765FFZ