BDBM50315427 (1S)-1,5-Anhydro-1-[4-chloro-3-[4-(methylsulfanyl)benzyl]phenyl]-1-thio-D-glucitol::CHEMBL1093422
SMILES: CSc1ccc(Cc2cc(ccc2Cl)[C@@H]2S[C@H](CO)[C@@H](O)[C@H](O)[C@H]2O)cc1
InChI Key: InChIKey=XJDJYLNJNLGAEM-OBKDMQGPSA-N
Data: 2 IC50
Activity Spreadsheet -- Enzyme Inhibition Constant Data from BindingDB
Found 2 hits for monomerid = 50315427
Trg + Lig
Ki
nM
ΔG°
kcal/mole
IC50
nM
Kd
nM
EC50/IC50
nM
koff
s-1
kon
M-1s-1
pHTemp
°C
Sodium/glucose cotransporter 1 (SGLT1)
(Homo sapiens (Human))
BDBM50315427
((1S)-1,5-Anhydro-1-[4-chloro-3-[4-(methylsulfanyl)...)
Show SMILES CSc1ccc(Cc2cc(ccc2Cl)[C@@H]2S[C@H](CO)[C@@H](O)[C@H](O)[C@H]2O)cc1 |r|
Show InChI InChI=1S/C20H23ClO4S2/c1-26-14-5-2-11(3-6-14)8-13-9-12(4-7-15(13)21)20-19(25)18(24)17(23)16(10-22)27-20/h2-7,9,16-20,22-25H,8,10H2,1H3/t16-,17-,18+,19-,20+/m1/s1
n/an/a 391n/an/an/an/an/an/a
Taisho Pharmaceutical Co., Ltd.
Curated by ChEMBL
Assay Description
Inhibition of human SGLT1 expressed in CHOK1 cells assessed as inhibition of glucose uptake
J Med Chem 53: 3247-61 (2010)
Article DOI: 10.1021/jm901893x
BindingDB Entry DOI: 10.7270/Q2KH0NG6
Sodium/glucose cotransporter 2
(Homo sapiens (Human))
BDBM50315427
((1S)-1,5-Anhydro-1-[4-chloro-3-[4-(methylsulfanyl)...)
Show SMILES CSc1ccc(Cc2cc(ccc2Cl)[C@@H]2S[C@H](CO)[C@@H](O)[C@H](O)[C@H]2O)cc1 |r|
Show InChI InChI=1S/C20H23ClO4S2/c1-26-14-5-2-11(3-6-14)8-13-9-12(4-7-15(13)21)20-19(25)18(24)17(23)16(10-22)27-20/h2-7,9,16-20,22-25H,8,10H2,1H3/t16-,17-,18+,19-,20+/m1/s1
n/an/a 1.20n/an/an/an/an/an/a
Taisho Pharmaceutical Co., Ltd.
Curated by ChEMBL
Assay Description
Inhibition of human SGLT2 expressed in CHOK1 cells assessed as inhibition of glucose uptake
J Med Chem 53: 3247-61 (2010)
Article DOI: 10.1021/jm901893x
BindingDB Entry DOI: 10.7270/Q2KH0NG6