BDBM50315429 (1S)-1,5-Anhydro-1-[4-chloro-3-[4-(propan-2-yl)benzyl]phenyl]-1-thio-D-glucitol::CHEMBL1091547
SMILES: CC(C)c1ccc(Cc2cc(ccc2Cl)[C@@H]2S[C@H](CO)[C@@H](O)[C@H](O)[C@H]2O)cc1
InChI Key: InChIKey=MLRXRRJAIMLXSP-BDHVOXNPSA-N
Data: 2 IC50
Activity Spreadsheet -- Enzyme Inhibition Constant Data from BindingDB
Found 2 hits for monomerid = 50315429
Trg + Lig
Ki
nM
ΔG°
kcal/mole
IC50
nM
Kd
nM
EC50/IC50
nM
koff
s-1
kon
M-1s-1
pHTemp
°C
Sodium/glucose cotransporter 1 (SGLT1)
(Homo sapiens (Human))
BDBM50315429
((1S)-1,5-Anhydro-1-[4-chloro-3-[4-(propan-2-yl)ben...)
Show SMILES CC(C)c1ccc(Cc2cc(ccc2Cl)[C@@H]2S[C@H](CO)[C@@H](O)[C@H](O)[C@H]2O)cc1 |r|
Show InChI InChI=1S/C22H27ClO4S/c1-12(2)14-5-3-13(4-6-14)9-16-10-15(7-8-17(16)23)22-21(27)20(26)19(25)18(11-24)28-22/h3-8,10,12,18-22,24-27H,9,11H2,1-2H3/t18-,19-,20+,21-,22+/m1/s1
n/an/a 8.16E+3n/an/an/an/an/an/a
Taisho Pharmaceutical Co., Ltd.
Curated by ChEMBL
Assay Description
Inhibition of human SGLT1 expressed in CHOK1 cells assessed as inhibition of glucose uptake
J Med Chem 53: 3247-61 (2010)
Article DOI: 10.1021/jm901893x
BindingDB Entry DOI: 10.7270/Q2KH0NG6
Sodium/glucose cotransporter 2
(Homo sapiens (Human))
BDBM50315429
((1S)-1,5-Anhydro-1-[4-chloro-3-[4-(propan-2-yl)ben...)
Show SMILES CC(C)c1ccc(Cc2cc(ccc2Cl)[C@@H]2S[C@H](CO)[C@@H](O)[C@H](O)[C@H]2O)cc1 |r|
Show InChI InChI=1S/C22H27ClO4S/c1-12(2)14-5-3-13(4-6-14)9-16-10-15(7-8-17(16)23)22-21(27)20(26)19(25)18(11-24)28-22/h3-8,10,12,18-22,24-27H,9,11H2,1-2H3/t18-,19-,20+,21-,22+/m1/s1
n/an/a 4n/an/an/an/an/an/a
Taisho Pharmaceutical Co., Ltd.
Curated by ChEMBL
Assay Description
Inhibition of human SGLT2 expressed in CHOK1 cells assessed as inhibition of glucose uptake
J Med Chem 53: 3247-61 (2010)
Article DOI: 10.1021/jm901893x
BindingDB Entry DOI: 10.7270/Q2KH0NG6