BDBM50315495 3-(1-(2,4-dichlorobenzyl)-2-oxoindolin-7-yl)-N-(3,4-dichlorophenylsulfonyl)acrylamide::CHEMBL1093797
SMILES: Clc1ccc(CN2C(=O)Cc3cccc(\C=C\C(=O)NS(=O)(=O)c4ccc(Cl)c(Cl)c4)c23)c(Cl)c1
InChI Key: InChIKey=IITIDBUPAHYEPZ-WEVVVXLNSA-N
Data: 2 IC50
Activity Spreadsheet -- Enzyme Inhibition Constant Data from BindingDB
Found 2 hits for monomerid = 50315495
Trg + Lig
Ki
nM
ΔG°
kcal/mole
IC50
nM
Kd
nM
EC50/IC50
nM
koff
s-1
kon
M-1s-1
pHTemp
°C
Prostaglandin E2 receptor
(Homo sapiens (Human))
BDBM50315495
(3-(1-(2,4-dichlorobenzyl)-2-oxoindolin-7-yl)-N-(3,...)
Show SMILES Clc1ccc(CN2C(=O)Cc3cccc(\C=C\C(=O)NS(=O)(=O)c4ccc(Cl)c(Cl)c4)c23)c(Cl)c1
Show InChI InChI=1S/C24H16Cl4N2O4S/c25-17-6-4-16(20(27)11-17)13-30-23(32)10-15-3-1-2-14(24(15)30)5-9-22(31)29-35(33,34)18-7-8-19(26)21(28)12-18/h1-9,11-12H,10,13H2,(H,29,31)/b9-5+
n/an/a 3.30n/an/an/an/an/an/a
deCODE Chemistry
Curated by ChEMBL
Assay Description
Displacement of [3H]PGE2 from human EP3 receptor in presence of 10% human serum
Bioorg Med Chem Lett 20: 2658-64 (2010)
Article DOI: 10.1016/j.bmcl.2010.02.028
BindingDB Entry DOI: 10.7270/Q2668DCG
Prostaglandin E2 receptor
(Homo sapiens (Human))
BDBM50315495
(3-(1-(2,4-dichlorobenzyl)-2-oxoindolin-7-yl)-N-(3,...)
Show SMILES Clc1ccc(CN2C(=O)Cc3cccc(\C=C\C(=O)NS(=O)(=O)c4ccc(Cl)c(Cl)c4)c23)c(Cl)c1
Show InChI InChI=1S/C24H16Cl4N2O4S/c25-17-6-4-16(20(27)11-17)13-30-23(32)10-15-3-1-2-14(24(15)30)5-9-22(31)29-35(33,34)18-7-8-19(26)21(28)12-18/h1-9,11-12H,10,13H2,(H,29,31)/b9-5+
n/an/a 1.20n/an/an/an/an/an/a
deCODE Chemistry
Curated by ChEMBL
Assay Description
Displacement of [3H]PGE2 from human EP3 receptor in buffer
Bioorg Med Chem Lett 20: 2658-64 (2010)
Article DOI: 10.1016/j.bmcl.2010.02.028
BindingDB Entry DOI: 10.7270/Q2668DCG