BDBM50315517 CHEMBL1093133::N-(3,4-dichlorophenylsulfonyl)-3-(1-(naphthalen-2-ylmethyl)-2,3-dioxoindolin-7-yl)acrylamide
SMILES: Clc1ccc(cc1Cl)S(=O)(=O)NC(=O)\C=C\c1cccc2C(=O)C(=O)N(Cc3ccc4ccccc4c3)c12
InChI Key: InChIKey=GOEFYRYOHBADTM-JLHYYAGUSA-N
Data: 2 IC50
Activity Spreadsheet -- Enzyme Inhibition Constant Data from BindingDB
Found 2 hits for monomerid = 50315517
Trg + Lig
Ki
nM
ΔG°
kcal/mole
IC50
nM
Kd
nM
EC50/IC50
nM
koff
s-1
kon
M-1s-1
pHTemp
°C
Prostaglandin E2 receptor
(Homo sapiens (Human))
BDBM50315517
(CHEMBL1093133 | N-(3,4-dichlorophenylsulfonyl)-3-(...)
Show SMILES Clc1ccc(cc1Cl)S(=O)(=O)NC(=O)\C=C\c1cccc2C(=O)C(=O)N(Cc3ccc4ccccc4c3)c12
Show InChI InChI=1S/C28H18Cl2N2O5S/c29-23-12-11-21(15-24(23)30)38(36,37)31-25(33)13-10-19-6-3-7-22-26(19)32(28(35)27(22)34)16-17-8-9-18-4-1-2-5-20(18)14-17/h1-15H,16H2,(H,31,33)/b13-10+
n/an/a 12.7n/an/an/an/an/an/a
deCODE Chemistry
Curated by ChEMBL
Assay Description
Displacement of [3H]PGE2 from human EP3 receptor in presence of 10% human serum
Bioorg Med Chem Lett 20: 2658-64 (2010)
Article DOI: 10.1016/j.bmcl.2010.02.028
BindingDB Entry DOI: 10.7270/Q2668DCG
Prostaglandin E2 receptor
(Homo sapiens (Human))
BDBM50315517
(CHEMBL1093133 | N-(3,4-dichlorophenylsulfonyl)-3-(...)
Show SMILES Clc1ccc(cc1Cl)S(=O)(=O)NC(=O)\C=C\c1cccc2C(=O)C(=O)N(Cc3ccc4ccccc4c3)c12
Show InChI InChI=1S/C28H18Cl2N2O5S/c29-23-12-11-21(15-24(23)30)38(36,37)31-25(33)13-10-19-6-3-7-22-26(19)32(28(35)27(22)34)16-17-8-9-18-4-1-2-5-20(18)14-17/h1-15H,16H2,(H,31,33)/b13-10+
n/an/a 1n/an/an/an/an/an/a
deCODE Chemistry
Curated by ChEMBL
Assay Description
Displacement of [3H]PGE2 from human EP3 receptor in buffer
Bioorg Med Chem Lett 20: 2658-64 (2010)
Article DOI: 10.1016/j.bmcl.2010.02.028
BindingDB Entry DOI: 10.7270/Q2668DCG