BDBM50315552 (S)-5-(2-amino-2-methyl-3-(phosphonooxy)propanamido)-2-(2-(biphenyl-4-yl)ethoxy)benzoic acid::CHEMBL1092191
SMILES: C[C@](N)(COP(O)(O)=O)C(=O)Nc1ccc(OCCc2ccc(cc2)-c2ccccc2)c(c1)C(O)=O
InChI Key: InChIKey=JMQISUVMGYJTBB-VWLOTQADSA-N
Data: 2 IC50
Activity Spreadsheet -- Enzyme Inhibition Constant Data from BindingDB
Found 2 hits for monomerid = 50315552
Trg + Lig
Ki
nM
ΔG°
kcal/mole
IC50
nM
Kd
nM
EC50/IC50
nM
koff
s-1
kon
M-1s-1
pHTemp
°C
Sphingosine 1-phosphate receptor 3
(Homo sapiens (Human))
BDBM50315552
((S)-5-(2-amino-2-methyl-3-(phosphonooxy)propanamid...)
Show SMILES C[C@](N)(COP(O)(O)=O)C(=O)Nc1ccc(OCCc2ccc(cc2)-c2ccccc2)c(c1)C(O)=O |r|
Show InChI InChI=1S/C25H27N2O8P/c1-25(26,16-35-36(31,32)33)24(30)27-20-11-12-22(21(15-20)23(28)29)34-14-13-17-7-9-19(10-8-17)18-5-3-2-4-6-18/h2-12,15H,13-14,16,26H2,1H3,(H,27,30)(H,28,29)(H2,31,32,33)/t25-/m0/s1
NCI pathway
Reactome pathway
n/an/a>1.00E+4n/an/an/an/an/an/a
Praecis Pharmaceuticals Inc
Curated by ChEMBL
Assay Description
Displacement of [33P]sphingosine-1-phosphate from human S1P3 receptor expressed in HEK293T cells after 60 mins by scintillation counting
Bioorg Med Chem Lett 20: 2520-4 (2010)
Article DOI: 10.1016/j.bmcl.2010.02.098
BindingDB Entry DOI: 10.7270/Q2XS5VJB
Sphingosine 1-phosphate receptor 1
(Homo sapiens (Human))
BDBM50315552
((S)-5-(2-amino-2-methyl-3-(phosphonooxy)propanamid...)
Show SMILES C[C@](N)(COP(O)(O)=O)C(=O)Nc1ccc(OCCc2ccc(cc2)-c2ccccc2)c(c1)C(O)=O |r|
Show InChI InChI=1S/C25H27N2O8P/c1-25(26,16-35-36(31,32)33)24(30)27-20-11-12-22(21(15-20)23(28)29)34-14-13-17-7-9-19(10-8-17)18-5-3-2-4-6-18/h2-12,15H,13-14,16,26H2,1H3,(H,27,30)(H,28,29)(H2,31,32,33)/t25-/m0/s1
Reactome pathway
n/an/a>1.00E+4n/an/an/an/an/an/a
Praecis Pharmaceuticals Inc
Curated by ChEMBL
Assay Description
Displacement of [33P]sphingosine-1-phosphate from human S1P1 receptor expressed in HEK293T cells after 60 mins by scintillation counting
Bioorg Med Chem Lett 20: 2520-4 (2010)
Article DOI: 10.1016/j.bmcl.2010.02.098
BindingDB Entry DOI: 10.7270/Q2XS5VJB