BDBM50315557 (S)-2-amino-3-(4-(2-(biphenyl-4-yl)ethoxy)-3-bromophenylamino)-2-methyl-3-oxopropyl dihydrogen phosphate::CHEMBL1089127
SMILES: C[C@](N)(COP(O)(O)=O)C(=O)Nc1ccc(OCCc2ccc(cc2)-c2ccccc2)c(Br)c1
InChI Key: InChIKey=UOLFBZYNLRKEKZ-DEOSSOPVSA-N
Data: 2 IC50
Activity Spreadsheet -- Enzyme Inhibition Constant Data from BindingDB
Found 2 hits for monomerid = 50315557
Trg + Lig
Ki
nM
ΔG°
kcal/mole
IC50
nM
Kd
nM
EC50/IC50
nM
koff
s-1
kon
M-1s-1
pHTemp
°C
Sphingosine 1-phosphate receptor 3
(Homo sapiens (Human))
BDBM50315557
((S)-2-amino-3-(4-(2-(biphenyl-4-yl)ethoxy)-3-bromo...)
Show SMILES C[C@](N)(COP(O)(O)=O)C(=O)Nc1ccc(OCCc2ccc(cc2)-c2ccccc2)c(Br)c1 |r|
Show InChI InChI=1S/C24H26BrN2O6P/c1-24(26,16-33-34(29,30)31)23(28)27-20-11-12-22(21(25)15-20)32-14-13-17-7-9-19(10-8-17)18-5-3-2-4-6-18/h2-12,15H,13-14,16,26H2,1H3,(H,27,28)(H2,29,30,31)/t24-/m0/s1
NCI pathway
Reactome pathway
n/an/a 1.00E+3n/an/an/an/an/an/a
Praecis Pharmaceuticals Inc
Curated by ChEMBL
Assay Description
Displacement of [33P]sphingosine-1-phosphate from human S1P3 receptor expressed in HEK293T cells after 60 mins by scintillation counting
Bioorg Med Chem Lett 20: 2520-4 (2010)
Article DOI: 10.1016/j.bmcl.2010.02.098
BindingDB Entry DOI: 10.7270/Q2XS5VJB
Sphingosine 1-phosphate receptor 1
(Homo sapiens (Human))
BDBM50315557
((S)-2-amino-3-(4-(2-(biphenyl-4-yl)ethoxy)-3-bromo...)
Show SMILES C[C@](N)(COP(O)(O)=O)C(=O)Nc1ccc(OCCc2ccc(cc2)-c2ccccc2)c(Br)c1 |r|
Show InChI InChI=1S/C24H26BrN2O6P/c1-24(26,16-33-34(29,30)31)23(28)27-20-11-12-22(21(25)15-20)32-14-13-17-7-9-19(10-8-17)18-5-3-2-4-6-18/h2-12,15H,13-14,16,26H2,1H3,(H,27,28)(H2,29,30,31)/t24-/m0/s1
Reactome pathway
n/an/a 1.30n/an/an/an/an/an/a
Praecis Pharmaceuticals Inc
Curated by ChEMBL
Assay Description
Displacement of [33P]sphingosine-1-phosphate from human S1P1 receptor expressed in HEK293T cells after 60 mins by scintillation counting
Bioorg Med Chem Lett 20: 2520-4 (2010)
Article DOI: 10.1016/j.bmcl.2010.02.098
BindingDB Entry DOI: 10.7270/Q2XS5VJB