BDBM50315610 (4-Trifluoromethylphenyl)-[7-(3-trifluoromethylpyridin-2-yl)-pteridin-4-yl]amine::CHEMBL1092853
SMILES: FC(F)(F)c1ccc(Nc2ncnc3nc(cnc23)-c2ncccc2C(F)(F)F)cc1
InChI Key: InChIKey=FMUUOSKGOPDNLL-UHFFFAOYSA-N
Data: 1 IC50
Activity Spreadsheet -- Enzyme Inhibition Constant Data from BindingDB
Found 1 hit for monomerid = 50315610
Trg + Lig
Ki
nM
ΔG°
kcal/mole
IC50
nM
Kd
nM
EC50/IC50
nM
koff
s-1
kon
M-1s-1
pHTemp
°C
Transient receptor potential cation channel subfamily V member 1
(Homo sapiens (Human))
BDBM50315610
((4-Trifluoromethylphenyl)-[7-(3-trifluoromethylpyr...)
Show SMILES FC(F)(F)c1ccc(Nc2ncnc3nc(cnc23)-c2ncccc2C(F)(F)F)cc1
Show InChI InChI=1S/C19H10F6N6/c20-18(21,22)10-3-5-11(6-4-10)30-16-15-17(29-9-28-16)31-13(8-27-15)14-12(19(23,24)25)2-1-7-26-14/h1-9H,(H,28,29,30,31)
Reactome pathway
n/an/a 0.210n/an/an/an/an/an/a
Neurogen Corporation
Curated by ChEMBL
Assay Description
Antagonist activity at human recombinant TRPV1 expressed in HEK293 cells assessed as inhibition of capsazepine-induced calcium mobilization by FLIPR ...
J Med Chem 53: 3330-48 (2010)
Article DOI: 10.1021/jm100051g
BindingDB Entry DOI: 10.7270/Q2474BTP