BDBM50315612 7-[3-(Trifluoromethyl)pyridin-2-yl]-N-[5-(trifluoromethyl)-pyridin-2-yl]quinolin-4-amine::CHEMBL1093132
SMILES: FC(F)(F)c1ccc(Nc2ccnc3cc(ccc23)-c2ncccc2C(F)(F)F)nc1
InChI Key: InChIKey=ZZFNGMUTCXRSSB-UHFFFAOYSA-N
Data: 1 IC50
Activity Spreadsheet -- Enzyme Inhibition Constant Data from BindingDB
Found 1 hit for monomerid = 50315612
Trg + Lig
Ki
nM
ΔG°
kcal/mole
IC50
nM
Kd
nM
EC50/IC50
nM
koff
s-1
kon
M-1s-1
pHTemp
°C
Transient receptor potential cation channel subfamily V member 1
(Homo sapiens (Human))
BDBM50315612
(7-[3-(Trifluoromethyl)pyridin-2-yl]-N-[5-(trifluor...)
Show SMILES FC(F)(F)c1ccc(Nc2ccnc3cc(ccc23)-c2ncccc2C(F)(F)F)nc1
Show InChI InChI=1S/C21H12F6N4/c22-20(23,24)13-4-6-18(30-11-13)31-16-7-9-28-17-10-12(3-5-14(16)17)19-15(21(25,26)27)2-1-8-29-19/h1-11H,(H,28,30,31)
Reactome pathway
n/an/a 1.65n/an/an/an/an/an/a
Neurogen Corporation
Curated by ChEMBL
Assay Description
Antagonist activity at human recombinant TRPV1 expressed in HEK293 cells assessed as inhibition of capsazepine-induced calcium mobilization by FLIPR ...
J Med Chem 53: 3330-48 (2010)
Article DOI: 10.1021/jm100051g
BindingDB Entry DOI: 10.7270/Q2474BTP