BDBM50315614 (4-Trifluoromethylphenyl)-[7-(3-trifluoromethylpyridin-2-yl)-[1,8]naphthyridin-4-ylamine::CHEMBL1089118
SMILES: FC(F)(F)c1ccc(Nc2ccnc3nc(ccc23)-c2ncccc2C(F)(F)F)cc1
InChI Key: InChIKey=HLHIQJCUGILCBW-UHFFFAOYSA-N
Data: 1 IC50
Activity Spreadsheet -- Enzyme Inhibition Constant Data from BindingDB
Found 1 hit for monomerid = 50315614
Trg + Lig
Ki
nM
ΔG°
kcal/mole
IC50
nM
Kd
nM
EC50/IC50
nM
koff
s-1
kon
M-1s-1
pHTemp
°C
Transient receptor potential cation channel subfamily V member 1
(Homo sapiens (Human))
BDBM50315614
((4-Trifluoromethylphenyl)-[7-(3-trifluoromethylpyr...)
Show SMILES FC(F)(F)c1ccc(Nc2ccnc3nc(ccc23)-c2ncccc2C(F)(F)F)cc1
Show InChI InChI=1S/C21H12F6N4/c22-20(23,24)12-3-5-13(6-4-12)30-16-9-11-29-19-14(16)7-8-17(31-19)18-15(21(25,26)27)2-1-10-28-18/h1-11H,(H,29,30,31)
Reactome pathway
n/an/a 6.10n/an/an/an/an/an/a
Neurogen Corporation
Curated by ChEMBL
Assay Description
Antagonist activity at human recombinant TRPV1 expressed in HEK293 cells assessed as inhibition of capsazepine-induced calcium mobilization by FLIPR ...
J Med Chem 53: 3330-48 (2010)
Article DOI: 10.1021/jm100051g
BindingDB Entry DOI: 10.7270/Q2474BTP