BDBM50315758 CHEMBL1092072::N-[2-(Dimethylamino)ethyl]-N-methyl-4-[({4-[4-morpholin-4-yl-7-(2,2,2-trifluoroethyl)-7H-pyrrolo[2,3-d]pyrimidin-2-yl]phenyl}carbamoyl)amino]benzamide
SMILES: CN(C)CCN(C)C(=O)c1ccc(NC(=O)Nc2ccc(cc2)-c2nc(N3CCOCC3)c3ccn(CC(F)(F)F)c3n2)cc1
InChI Key: InChIKey=GMASZVAHNYVURN-UHFFFAOYSA-N
Data: 2 IC50
Activity Spreadsheet -- Enzyme Inhibition Constant Data from BindingDB
Found 2 hits for monomerid = 50315758
Trg + Lig
Ki
nM
ΔG°
kcal/mole
IC50
nM
Kd
nM
EC50/IC50
nM
koff
s-1
kon
M-1s-1
pHTemp
°C
Serine/threonine-protein kinase mTOR
(Homo sapiens (Human))
BDBM50315758
(CHEMBL1092072 | N-[2-(Dimethylamino)ethyl]-N-methy...)
Show SMILES CN(C)CCN(C)C(=O)c1ccc(NC(=O)Nc2ccc(cc2)-c2nc(N3CCOCC3)c3ccn(CC(F)(F)F)c3n2)cc1
Show InChI InChI=1S/C31H35F3N8O3/c1-39(2)14-15-40(3)29(43)22-6-10-24(11-7-22)36-30(44)35-23-8-4-21(5-9-23)26-37-27(41-16-18-45-19-17-41)25-12-13-42(28(25)38-26)20-31(32,33)34/h4-13H,14-20H2,1-3H3,(H2,35,36,44)
NCI pathway
Reactome pathway
n/an/a 0.600n/an/an/an/an/an/a
Wyeth Research
Curated by ChEMBL
Assay Description
Inhibition of mTOR by DELFIA
J Med Chem 53: 3169-82 (2010)
Article DOI: 10.1021/jm901783v
BindingDB Entry DOI: 10.7270/Q21J99XP
Phosphatidylinositol 4,5-bisphosphate 3-kinase catalytic subunit alpha isoform
(Homo sapiens (Human))
BDBM50315758
(CHEMBL1092072 | N-[2-(Dimethylamino)ethyl]-N-methy...)
Show SMILES CN(C)CCN(C)C(=O)c1ccc(NC(=O)Nc2ccc(cc2)-c2nc(N3CCOCC3)c3ccn(CC(F)(F)F)c3n2)cc1
Show InChI InChI=1S/C31H35F3N8O3/c1-39(2)14-15-40(3)29(43)22-6-10-24(11-7-22)36-30(44)35-23-8-4-21(5-9-23)26-37-27(41-16-18-45-19-17-41)25-12-13-42(28(25)38-26)20-31(32,33)34/h4-13H,14-20H2,1-3H3,(H2,35,36,44)
NCI pathway
Reactome pathway
n/an/a 0.900n/an/an/an/an/an/a
Wyeth Research
Curated by ChEMBL
Assay Description
Inhibition of human PI3Kalpha by fluorescence polarization format assay
J Med Chem 53: 3169-82 (2010)
Article DOI: 10.1021/jm901783v
BindingDB Entry DOI: 10.7270/Q21J99XP