BDBM50315818 2-Amino-4-[2'-fluoro-4'-(3-methylphenylthio)biphenyl-4-yl]-2-(phosphoryloxymethyl)butanol::CHEMBL1089809
SMILES: Cc1cccc(Sc2ccc(c(F)c2)-c2ccc(CCC(N)(CO)COP(O)(O)=O)cc2)c1
InChI Key: InChIKey=OXHJCCNQRFGZGH-UHFFFAOYSA-N
Data: 2 EC50
Activity Spreadsheet -- Enzyme Inhibition Constant Data from BindingDB
Found 2 hits for monomerid = 50315818
Trg + Lig
Ki
nM
ΔG°
kcal/mole
IC50
nM
Kd
nM
EC50/IC50
nM
koff
s-1
kon
M-1s-1
pHTemp
°C
Sphingosine 1-phosphate receptor 3
(Homo sapiens (Human))
BDBM50315818
(2-Amino-4-[2'-fluoro-4'-(3-methylphenylthio)biphen...)
Show SMILES Cc1cccc(Sc2ccc(c(F)c2)-c2ccc(CCC(N)(CO)COP(O)(O)=O)cc2)c1
Show InChI InChI=1S/C24H27FNO5PS/c1-17-3-2-4-20(13-17)33-21-9-10-22(23(25)14-21)19-7-5-18(6-8-19)11-12-24(26,15-27)16-31-32(28,29)30/h2-10,13-14,27H,11-12,15-16,26H2,1H3,(H2,28,29,30)
NCI pathway
Reactome pathway
n/an/an/an/a>1.00E+3n/an/an/an/a
Mitsubishi Tanabe Pharma Corporation
Curated by ChEMBL
Assay Description
Agonist activity at human S1P3 receptor expressed in CHO cells assessed as intracellular calcium mobilization
J Med Chem 53: 3154-68 (2010)
Article DOI: 10.1021/jm901776q
BindingDB Entry DOI: 10.7270/Q2HH6K7W
Sphingosine 1-phosphate receptor 1
(Homo sapiens (Human))
BDBM50315818
(2-Amino-4-[2'-fluoro-4'-(3-methylphenylthio)biphen...)
Show SMILES Cc1cccc(Sc2ccc(c(F)c2)-c2ccc(CCC(N)(CO)COP(O)(O)=O)cc2)c1
Show InChI InChI=1S/C24H27FNO5PS/c1-17-3-2-4-20(13-17)33-21-9-10-22(23(25)14-21)19-7-5-18(6-8-19)11-12-24(26,15-27)16-31-32(28,29)30/h2-10,13-14,27H,11-12,15-16,26H2,1H3,(H2,28,29,30)
Reactome pathway
n/an/an/an/a 2n/an/an/an/a
Mitsubishi Tanabe Pharma Corporation
Curated by ChEMBL
Assay Description
Agonist activity at human S1P1 receptor expressed in human Chem1 cells assessed as intracellular calcium mobilization
J Med Chem 53: 3154-68 (2010)
Article DOI: 10.1021/jm901776q
BindingDB Entry DOI: 10.7270/Q2HH6K7W