BDBM50315820 2-Amino-4-(4'-benzylthio-2'-fluorobiphenyl-4-yl)-2-(phosphoryloxymethyl)butanol::CHEMBL1090819
SMILES: NC(CO)(CCc1ccc(cc1)-c1ccc(SCc2ccccc2)cc1F)COP(O)(O)=O
InChI Key: InChIKey=DVJSZJXGRALSDM-UHFFFAOYSA-N
Data: 2 EC50
Activity Spreadsheet -- Enzyme Inhibition Constant Data from BindingDB
Found 2 hits for monomerid = 50315820
Trg + Lig
Ki
nM
ΔG°
kcal/mole
IC50
nM
Kd
nM
EC50/IC50
nM
koff
s-1
kon
M-1s-1
pHTemp
°C
Sphingosine 1-phosphate receptor 3
(Homo sapiens (Human))
BDBM50315820
(2-Amino-4-(4'-benzylthio-2'-fluorobiphenyl-4-yl)-2...)
Show SMILES NC(CO)(CCc1ccc(cc1)-c1ccc(SCc2ccccc2)cc1F)COP(O)(O)=O
Show InChI InChI=1S/C24H27FNO5PS/c25-23-14-21(33-15-19-4-2-1-3-5-19)10-11-22(23)20-8-6-18(7-9-20)12-13-24(26,16-27)17-31-32(28,29)30/h1-11,14,27H,12-13,15-17,26H2,(H2,28,29,30)
NCI pathway
Reactome pathway
n/an/an/an/a>1.00E+3n/an/an/an/a
Mitsubishi Tanabe Pharma Corporation
Curated by ChEMBL
Assay Description
Agonist activity at human S1P3 receptor expressed in CHO cells assessed as intracellular calcium mobilization
J Med Chem 53: 3154-68 (2010)
Article DOI: 10.1021/jm901776q
BindingDB Entry DOI: 10.7270/Q2HH6K7W
Sphingosine 1-phosphate receptor 1
(Homo sapiens (Human))
BDBM50315820
(2-Amino-4-(4'-benzylthio-2'-fluorobiphenyl-4-yl)-2...)
Show SMILES NC(CO)(CCc1ccc(cc1)-c1ccc(SCc2ccccc2)cc1F)COP(O)(O)=O
Show InChI InChI=1S/C24H27FNO5PS/c25-23-14-21(33-15-19-4-2-1-3-5-19)10-11-22(23)20-8-6-18(7-9-20)12-13-24(26,16-27)17-31-32(28,29)30/h1-11,14,27H,12-13,15-17,26H2,(H2,28,29,30)
Reactome pathway
n/an/an/an/a 0.840n/an/an/an/a
Mitsubishi Tanabe Pharma Corporation
Curated by ChEMBL
Assay Description
Agonist activity at human S1P1 receptor expressed in human Chem1 cells assessed as intracellular calcium mobilization
J Med Chem 53: 3154-68 (2010)
Article DOI: 10.1021/jm901776q
BindingDB Entry DOI: 10.7270/Q2HH6K7W