BDBM50315849 2-phenyl-N-(3-(2-phenylcyclopropyl)-1H-indazol-5-yl)acetamide::CHEMBL1090911
SMILES: O=C(Cc1ccccc1)Nc1ccc2[nH]nc(C3CC3c3ccccc3)c2c1
InChI Key: InChIKey=CIWJUMXZAYFUEI-UHFFFAOYSA-N
Data: 2 IC50
Activity Spreadsheet -- Enzyme Inhibition Constant Data from BindingDB
Found 2 hits for monomerid = 50315849
Trg + Lig
Ki
nM
ΔG°
kcal/mole
IC50
nM
Kd
nM
EC50/IC50
nM
koff
s-1
kon
M-1s-1
pHTemp
°C
Aurora kinase A
(Homo sapiens (Human))
BDBM50315849
(2-phenyl-N-(3-(2-phenylcyclopropyl)-1H-indazol-5-y...)
Show SMILES O=C(Cc1ccccc1)Nc1ccc2[nH]nc(C3CC3c3ccccc3)c2c1
Show InChI InChI=1S/C24H21N3O/c28-23(13-16-7-3-1-4-8-16)25-18-11-12-22-21(14-18)24(27-26-22)20-15-19(20)17-9-5-2-6-10-17/h1-12,14,19-20H,13,15H2,(H,25,28)(H,26,27)
NCI pathway
Reactome pathway
n/an/a 640n/an/an/an/an/an/a
S*BIO Pte. Ltd
Curated by ChEMBL
Assay Description
Inhibition of hexahistidine tagged recombinant Aurora A expressed in Hi-5 cells assessed as ATP remaining after 2 hrs by bioluminnescence
Bioorg Med Chem Lett 20: 2443-7 (2010)
Article DOI: 10.1016/j.bmcl.2010.03.018
BindingDB Entry DOI: 10.7270/Q24B31HK
Aurora kinase B
(Homo sapiens (Human))
BDBM50315849
(2-phenyl-N-(3-(2-phenylcyclopropyl)-1H-indazol-5-y...)
Show SMILES O=C(Cc1ccccc1)Nc1ccc2[nH]nc(C3CC3c3ccccc3)c2c1
Show InChI InChI=1S/C24H21N3O/c28-23(13-16-7-3-1-4-8-16)25-18-11-12-22-21(14-18)24(27-26-22)20-15-19(20)17-9-5-2-6-10-17/h1-12,14,19-20H,13,15H2,(H,25,28)(H,26,27)
Reactome pathway
n/an/a 1.64E+3n/an/an/an/an/an/a
S*BIO Pte. Ltd
Curated by ChEMBL
Assay Description
Inhibition of GST tagged recombinant Aurora B expressed in Hi-5 cells after 1 hr by TRF assay
Bioorg Med Chem Lett 20: 2443-7 (2010)
Article DOI: 10.1016/j.bmcl.2010.03.018
BindingDB Entry DOI: 10.7270/Q24B31HK