null
SMILES: Fc1ccc(cc1F)S(=O)(=O)NC(=O)CCc1ccc(Cn2cccn2)cc1ONCc1cccc2ccccc12
InChI Key: InChIKey=CUVIWZMOEZNKMO-UHFFFAOYSA-N
Activity Spreadsheet -- Enzyme Inhibition Constant Data from BindingDB
Found 5 hits for monomerid = 50315981
Trg + Lig
Ki
nM
ΔG°
kcal/mole
IC50
nM
Kd
nM
EC50/IC50
nM
koff
s-1
kon
M-1s-1
pHTemp
°C
Prostaglandin E2 receptor EP3 subtype
(Mus musculus (Mouse))
BDBM50315981
(3-(4-((1H-pyrazol-1-yl)methyl)-2-(naphthalen-1-ylm...)
Show SMILES Fc1ccc(cc1F)S(=O)(=O)NC(=O)CCc1ccc(Cn2cccn2)cc1ONCc1cccc2ccccc12
Show InChI InChI=1S/C30H26F2N4O4S/c31-27-13-12-25(18-28(27)32)41(38,39)35-30(37)14-11-23-10-9-21(20-36-16-4-15-33-36)17-29(23)40-34-19-24-7-3-6-22-5-1-2-8-26(22)24/h1-10,12-13,15-18,34H,11,14,19-20H2,(H,35,37)
n/an/a 1.40n/an/an/an/an/an/a
Minase Research Institute
Curated by ChEMBL
Assay Description
Antagonist activity at mouse EP3 receptor expressed in CHO cells assessed as inhibition of PGE2-induced increase in intracellular calcium level after...
Bioorg Med Chem Lett 20: 2639-43 (2010)
Article DOI: 10.1016/j.bmcl.2010.02.034
BindingDB Entry DOI: 10.7270/Q23B6099
Prostaglandin E2 receptor EP2 subtype
(Mus musculus (Mouse))
BDBM50315981
(3-(4-((1H-pyrazol-1-yl)methyl)-2-(naphthalen-1-ylm...)
Show SMILES Fc1ccc(cc1F)S(=O)(=O)NC(=O)CCc1ccc(Cn2cccn2)cc1ONCc1cccc2ccccc12
Show InChI InChI=1S/C30H26F2N4O4S/c31-27-13-12-25(18-28(27)32)41(38,39)35-30(37)14-11-23-10-9-21(20-36-16-4-15-33-36)17-29(23)40-34-19-24-7-3-6-22-5-1-2-8-26(22)24/h1-10,12-13,15-18,34H,11,14,19-20H2,(H,35,37)
Reactome pathway
>1.00E+4n/an/an/an/an/an/an/an/a
Minase Research Institute
Curated by ChEMBL
Assay Description
Displacement of [3H]PGE2 from mouse EP2 receptor expressed in CHO cells after 60 mins by scintillation counter
Bioorg Med Chem Lett 20: 2639-43 (2010)
Article DOI: 10.1016/j.bmcl.2010.02.034
BindingDB Entry DOI: 10.7270/Q23B6099
Prostaglandin E2 receptor EP3 subtype
(Mus musculus (Mouse))
BDBM50315981
(3-(4-((1H-pyrazol-1-yl)methyl)-2-(naphthalen-1-ylm...)
Show SMILES Fc1ccc(cc1F)S(=O)(=O)NC(=O)CCc1ccc(Cn2cccn2)cc1ONCc1cccc2ccccc12
Show InChI InChI=1S/C30H26F2N4O4S/c31-27-13-12-25(18-28(27)32)41(38,39)35-30(37)14-11-23-10-9-21(20-36-16-4-15-33-36)17-29(23)40-34-19-24-7-3-6-22-5-1-2-8-26(22)24/h1-10,12-13,15-18,34H,11,14,19-20H2,(H,35,37)
0.130n/an/an/an/an/an/an/an/a
Minase Research Institute
Curated by ChEMBL
Assay Description
Displacement of [3H]PGE2 from mouse EP3 receptor expressed in CHO cells after 60 mins by scintillation counter
Bioorg Med Chem Lett 20: 2639-43 (2010)
Article DOI: 10.1016/j.bmcl.2010.02.034
BindingDB Entry DOI: 10.7270/Q23B6099
Prostaglandin E2 receptor EP4 subtype
(Mus musculus (Mouse))
BDBM50315981
(3-(4-((1H-pyrazol-1-yl)methyl)-2-(naphthalen-1-ylm...)
Show SMILES Fc1ccc(cc1F)S(=O)(=O)NC(=O)CCc1ccc(Cn2cccn2)cc1ONCc1cccc2ccccc12
Show InChI InChI=1S/C30H26F2N4O4S/c31-27-13-12-25(18-28(27)32)41(38,39)35-30(37)14-11-23-10-9-21(20-36-16-4-15-33-36)17-29(23)40-34-19-24-7-3-6-22-5-1-2-8-26(22)24/h1-10,12-13,15-18,34H,11,14,19-20H2,(H,35,37)
Reactome pathway
1.80E+3n/an/an/an/an/an/an/an/a
Minase Research Institute
Curated by ChEMBL
Assay Description
Displacement of [3H]PGE2 from mouse EP4 receptor expressed in CHO cells after 60 mins by scintillation counter
Bioorg Med Chem Lett 20: 2639-43 (2010)
Article DOI: 10.1016/j.bmcl.2010.02.034
BindingDB Entry DOI: 10.7270/Q23B6099
Prostaglandin E2 receptor EP1 subtype
(Mus musculus (Mouse))
BDBM50315981
(3-(4-((1H-pyrazol-1-yl)methyl)-2-(naphthalen-1-ylm...)
Show SMILES Fc1ccc(cc1F)S(=O)(=O)NC(=O)CCc1ccc(Cn2cccn2)cc1ONCc1cccc2ccccc12
Show InChI InChI=1S/C30H26F2N4O4S/c31-27-13-12-25(18-28(27)32)41(38,39)35-30(37)14-11-23-10-9-21(20-36-16-4-15-33-36)17-29(23)40-34-19-24-7-3-6-22-5-1-2-8-26(22)24/h1-10,12-13,15-18,34H,11,14,19-20H2,(H,35,37)
Reactome pathway
5.30E+3n/an/an/an/an/an/an/an/a
Minase Research Institute
Curated by ChEMBL
Assay Description
Displacement of [3H]PGE2 from mouse EP1 receptor expressed in CHO cells after 60 mins by scintillation counter
Bioorg Med Chem Lett 20: 2639-43 (2010)
Article DOI: 10.1016/j.bmcl.2010.02.034
BindingDB Entry DOI: 10.7270/Q23B6099