null
SMILES: CC(C)N(C)[C@@H]1CC[C@@H]([C@H](CS(=O)(=O)c2ccccc2)C1)N1CC[C@H](NC(=O)c2cccc(c2)C(F)(F)F)C1=O
InChI Key: InChIKey=JCEIOJXARAMKNB-JZUMHQTLSA-N
Activity Spreadsheet -- Enzyme Inhibition Constant Data from BindingDB
Found 6 hits for monomerid = 50315993
Trg + Lig
Ki
nM
ΔG°
kcal/mole
IC50
nM
Kd
nM
EC50/IC50
nM
koff
s-1
kon
M-1s-1
pHTemp
°C
C-C chemokine receptor type 2
(Homo sapiens (Human))
BDBM50315993
(CHEMBL1091605 | N-((S)-1-((1S,2R,4R)-4-(isopropyl(...)
Show SMILES CC(C)N(C)[C@@H]1CC[C@@H]([C@H](CS(=O)(=O)c2ccccc2)C1)N1CC[C@H](NC(=O)c2cccc(c2)C(F)(F)F)C1=O |r|
Show InChI InChI=1S/C29H36F3N3O4S/c1-19(2)34(3)23-12-13-26(21(17-23)18-40(38,39)24-10-5-4-6-11-24)35-15-14-25(28(35)37)33-27(36)20-8-7-9-22(16-20)29(30,31)32/h4-11,16,19,21,23,25-26H,12-15,17-18H2,1-3H3,(H,33,36)/t21-,23+,25-,26-/m0/s1
n/an/a 1n/an/an/an/an/an/a
Bristol-Myers Squibb Company
Curated by ChEMBL
Assay Description
Displacement of [125I]-labeled human MCP1 from CCR2 in human PBMC
Bioorg Med Chem Lett 24: 1843-5 (2014)
Article DOI: 10.1016/j.bmcl.2014.02.013
BindingDB Entry DOI: 10.7270/Q2FQ9Z4P
Potassium voltage-gated channel subfamily H member 2
(Homo sapiens (Human))
BDBM50315993
(CHEMBL1091605 | N-((S)-1-((1S,2R,4R)-4-(isopropyl(...)
Show SMILES CC(C)N(C)[C@@H]1CC[C@@H]([C@H](CS(=O)(=O)c2ccccc2)C1)N1CC[C@H](NC(=O)c2cccc(c2)C(F)(F)F)C1=O |r|
Show InChI InChI=1S/C29H36F3N3O4S/c1-19(2)34(3)23-12-13-26(21(17-23)18-40(38,39)24-10-5-4-6-11-24)35-15-14-25(28(35)37)33-27(36)20-8-7-9-22(16-20)29(30,31)32/h4-11,16,19,21,23,25-26H,12-15,17-18H2,1-3H3,(H,33,36)/t21-,23+,25-,26-/m0/s1
Reactome pathway
n/an/a 3.00E+4n/an/an/an/an/an/a
Bristol-Myers Squibb Company
Curated by ChEMBL
Assay Description
Inhibition of human ERG by FLIPR assay
Bioorg Med Chem Lett 24: 1843-5 (2014)
Article DOI: 10.1016/j.bmcl.2014.02.013
BindingDB Entry DOI: 10.7270/Q2FQ9Z4P
C-C chemokine receptor type 2
(Homo sapiens (Human))
BDBM50315993
(CHEMBL1091605 | N-((S)-1-((1S,2R,4R)-4-(isopropyl(...)
Show SMILES CC(C)N(C)[C@@H]1CC[C@@H]([C@H](CS(=O)(=O)c2ccccc2)C1)N1CC[C@H](NC(=O)c2cccc(c2)C(F)(F)F)C1=O |r|
Show InChI InChI=1S/C29H36F3N3O4S/c1-19(2)34(3)23-12-13-26(21(17-23)18-40(38,39)24-10-5-4-6-11-24)35-15-14-25(28(35)37)33-27(36)20-8-7-9-22(16-20)29(30,31)32/h4-11,16,19,21,23,25-26H,12-15,17-18H2,1-3H3,(H,33,36)/t21-,23+,25-,26-/m0/s1
n/an/a 1n/an/an/an/an/an/a
Bristol-Myers Squibb Company
Curated by ChEMBL
Assay Description
Displacement of [125I]-MCP1 from CCR2 in human THP1 cells after 30 mins
Bioorg Med Chem Lett 20: 2425-30 (2010)
Article DOI: 10.1016/j.bmcl.2010.03.035
BindingDB Entry DOI: 10.7270/Q2ZK5GTM
Potassium voltage-gated channel subfamily H member 2
(Homo sapiens (Human))
BDBM50315993
(CHEMBL1091605 | N-((S)-1-((1S,2R,4R)-4-(isopropyl(...)
Show SMILES CC(C)N(C)[C@@H]1CC[C@@H]([C@H](CS(=O)(=O)c2ccccc2)C1)N1CC[C@H](NC(=O)c2cccc(c2)C(F)(F)F)C1=O |r|
Show InChI InChI=1S/C29H36F3N3O4S/c1-19(2)34(3)23-12-13-26(21(17-23)18-40(38,39)24-10-5-4-6-11-24)35-15-14-25(28(35)37)33-27(36)20-8-7-9-22(16-20)29(30,31)32/h4-11,16,19,21,23,25-26H,12-15,17-18H2,1-3H3,(H,33,36)/t21-,23+,25-,26-/m0/s1
Reactome pathway
n/an/a 3.00E+4n/an/an/an/an/an/a
Bristol-Myers Squibb Company
Curated by ChEMBL
Assay Description
Inhibition of human ERG by FLIPR assay
Bioorg Med Chem Lett 20: 2425-30 (2010)
Article DOI: 10.1016/j.bmcl.2010.03.035
BindingDB Entry DOI: 10.7270/Q2ZK5GTM
C-C chemokine receptor type 2
(Homo sapiens (Human))
BDBM50315993
(CHEMBL1091605 | N-((S)-1-((1S,2R,4R)-4-(isopropyl(...)
Show SMILES CC(C)N(C)[C@@H]1CC[C@@H]([C@H](CS(=O)(=O)c2ccccc2)C1)N1CC[C@H](NC(=O)c2cccc(c2)C(F)(F)F)C1=O |r|
Show InChI InChI=1S/C29H36F3N3O4S/c1-19(2)34(3)23-12-13-26(21(17-23)18-40(38,39)24-10-5-4-6-11-24)35-15-14-25(28(35)37)33-27(36)20-8-7-9-22(16-20)29(30,31)32/h4-11,16,19,21,23,25-26H,12-15,17-18H2,1-3H3,(H,33,36)/t21-,23+,25-,26-/m0/s1
n/an/a 0.5n/an/an/an/an/an/a
Bristol-Myers Squibb Company
Curated by ChEMBL
Assay Description
Antagonist activity at CCR2 in human PBMC assessed as inhibition of MCP1-induced chemotaxis after 45 mins in presence of 0.1 M bovine serum albumin
Bioorg Med Chem Lett 20: 2425-30 (2010)
Article DOI: 10.1016/j.bmcl.2010.03.035
BindingDB Entry DOI: 10.7270/Q2ZK5GTM
C-C chemokine receptor type 2
(Homo sapiens (Human))
BDBM50315993
(CHEMBL1091605 | N-((S)-1-((1S,2R,4R)-4-(isopropyl(...)
Show SMILES CC(C)N(C)[C@@H]1CC[C@@H]([C@H](CS(=O)(=O)c2ccccc2)C1)N1CC[C@H](NC(=O)c2cccc(c2)C(F)(F)F)C1=O |r|
Show InChI InChI=1S/C29H36F3N3O4S/c1-19(2)34(3)23-12-13-26(21(17-23)18-40(38,39)24-10-5-4-6-11-24)35-15-14-25(28(35)37)33-27(36)20-8-7-9-22(16-20)29(30,31)32/h4-11,16,19,21,23,25-26H,12-15,17-18H2,1-3H3,(H,33,36)/t21-,23+,25-,26-/m0/s1
n/an/a 0.5n/an/an/an/an/an/a
Bristol-Myers Squibb Company
Curated by ChEMBL
Assay Description
Antagonist activity at CCR2 in human monocytes assessed as reduction of chemotaxis in presence of 0.1 M BSA
Bioorg Med Chem Lett 24: 1843-5 (2014)
Article DOI: 10.1016/j.bmcl.2014.02.013
BindingDB Entry DOI: 10.7270/Q2FQ9Z4P