BDBM50316005 7,9-Diamino-3-p-tolyl-3H-thieno[2,3-d:4,5-d']dipyrimidin-4-one::CHEMBL1093560
SMILES: Cc1ccc(cc1)-n1cnc2c3c(N)nc(N)nc3sc2c1=O
InChI Key: InChIKey=NGINYBBVZOLUBV-UHFFFAOYSA-N
Data: 2 KI  2 IC50
Activity Spreadsheet -- Enzyme Inhibition Constant Data from BindingDB
Found 4 hits for monomerid = 50316005
Trg + Lig
Ki
nM
ΔG°
kcal/mole
IC50
nM
Kd
nM
EC50/IC50
nM
koff
s-1
kon
M-1s-1
pHTemp
°C
Metabotropic glutamate receptor
(Rattus norvegicus (Rat))
BDBM50316005
(7,9-Diamino-3-p-tolyl-3H-thieno[2,3-d:4,5-d']dipyr...)
Show SMILES Cc1ccc(cc1)-n1cnc2c3c(N)nc(N)nc3sc2c1=O
Show InChI InChI=1S/C15H12N6OS/c1-7-2-4-8(5-3-7)21-6-18-10-9-12(16)19-15(17)20-13(9)23-11(10)14(21)22/h2-6H,1H3,(H4,16,17,19,20)
Reactome pathway
9.30n/an/an/an/an/an/an/an/a
Merck Research Laboratories
Curated by ChEMBL
Assay Description
Antagonist activity at rat mGluR1
Bioorg Med Chem Lett 20: 2474-7 (2010)
Article DOI: 10.1016/j.bmcl.2010.03.004
BindingDB Entry DOI: 10.7270/Q2TT4R39
Metabotropic glutamate receptor
(Rattus norvegicus (Rat))
BDBM50316005
(7,9-Diamino-3-p-tolyl-3H-thieno[2,3-d:4,5-d']dipyr...)
Show SMILES Cc1ccc(cc1)-n1cnc2c3c(N)nc(N)nc3sc2c1=O
Show InChI InChI=1S/C15H12N6OS/c1-7-2-4-8(5-3-7)21-6-18-10-9-12(16)19-15(17)20-13(9)23-11(10)14(21)22/h2-6H,1H3,(H4,16,17,19,20)
Reactome pathway
9.30n/an/an/an/an/an/an/an/a
Merck Research Laboratories
Curated by ChEMBL
Assay Description
Antagonist activity at rat mGluR1
Bioorg Med Chem Lett 20: 2474-7 (2010)
Article DOI: 10.1016/j.bmcl.2010.03.004
BindingDB Entry DOI: 10.7270/Q2TT4R39
Metabotropic glutamate receptor 5
(Homo sapiens (Human))
BDBM50316005
(7,9-Diamino-3-p-tolyl-3H-thieno[2,3-d:4,5-d']dipyr...)
Show SMILES Cc1ccc(cc1)-n1cnc2c3c(N)nc(N)nc3sc2c1=O
Show InChI InChI=1S/C15H12N6OS/c1-7-2-4-8(5-3-7)21-6-18-10-9-12(16)19-15(17)20-13(9)23-11(10)14(21)22/h2-6H,1H3,(H4,16,17,19,20)
n/an/a>3.00E+3n/an/an/an/an/an/a
Merck Research Laboratories
Curated by ChEMBL
Assay Description
Antagonist activity at human mGluR5
Bioorg Med Chem Lett 20: 2474-7 (2010)
Article DOI: 10.1016/j.bmcl.2010.03.004
BindingDB Entry DOI: 10.7270/Q2TT4R39
Metabotropic glutamate receptor 1
(Homo sapiens (Human))
BDBM50316005
(7,9-Diamino-3-p-tolyl-3H-thieno[2,3-d:4,5-d']dipyr...)
Show SMILES Cc1ccc(cc1)-n1cnc2c3c(N)nc(N)nc3sc2c1=O
Show InChI InChI=1S/C15H12N6OS/c1-7-2-4-8(5-3-7)21-6-18-10-9-12(16)19-15(17)20-13(9)23-11(10)14(21)22/h2-6H,1H3,(H4,16,17,19,20)
n/an/a 2.10n/an/an/an/an/an/a
Merck Research Laboratories
Curated by ChEMBL
Assay Description
Antagonist activity at human mGluR1
Bioorg Med Chem Lett 20: 2474-7 (2010)
Article DOI: 10.1016/j.bmcl.2010.03.004
BindingDB Entry DOI: 10.7270/Q2TT4R39