BDBM50316081 5-amino-2-((4'-((6-amino-3-hydroxy-1-sulfonaphthalen-2-yl)diazenyl)biphenyl-4-yl)diazenyl)-3-hydroxynaphthalene-1,7-disulfonic acid::CHEMBL1091752
SMILES: Nc1ccc2c(c(N=Nc3ccc(cc3)-c3ccc(cc3)N=Nc3c(O)c4c(N)cc(cc4cc3S(O)(=O)=O)S(O)(=O)=O)c(O)cc2c1)S(O)(=O)=O
InChI Key: InChIKey=LALBWRUYOHUXSH-UHFFFAOYSA-N
Data: 1 KI  1 IC50
Activity Spreadsheet -- Enzyme Inhibition Constant Data from BindingDB
Found 2 hits for monomerid = 50316081
Trg + Lig
Ki
nM
ΔG°
kcal/mole
IC50
nM
Kd
nM
EC50/IC50
nM
koff
s-1
kon
M-1s-1
pHTemp
°C
Ectonucleotide pyrophosphatase/phosphodiesterase family member 2
(Homo sapiens (Human))
BDBM50316081
(5-amino-2-((4'-((6-amino-3-hydroxy-1-sulfonaphthal...)
Show SMILES Nc1ccc2c(c(N=Nc3ccc(cc3)-c3ccc(cc3)N=Nc3c(O)c4c(N)cc(cc4cc3S(O)(=O)=O)S(O)(=O)=O)c(O)cc2c1)S(O)(=O)=O |w:21.22,8.8|
Show InChI InChI=1S/C32H24N6O11S3/c33-20-5-10-24-18(11-20)13-26(39)29(32(24)52(47,48)49)37-35-21-6-1-16(2-7-21)17-3-8-22(9-4-17)36-38-30-27(51(44,45)46)14-19-12-23(50(41,42)43)15-25(34)28(19)31(30)40/h1-15,39-40H,33-34H2,(H,41,42,43)(H,44,45,46)(H,47,48,49)
1.46E+3n/an/an/an/an/an/an/an/a
The University of Memphis
Curated by ChEMBL
Assay Description
Competitive inhibition of human recombinant C-terminal FLAG-tagged autotaxin expressed in baculovirus-infected Sf9 cells assessed as FS-3 hydrolysis ...
J Med Chem 53: 3095-105 (2010)
Article DOI: 10.1021/jm901718z
BindingDB Entry DOI: 10.7270/Q2QZ2BXS
Ectonucleotide pyrophosphatase/phosphodiesterase family member 2
(Homo sapiens (Human))
BDBM50316081
(5-amino-2-((4'-((6-amino-3-hydroxy-1-sulfonaphthal...)
Show SMILES Nc1ccc2c(c(N=Nc3ccc(cc3)-c3ccc(cc3)N=Nc3c(O)c4c(N)cc(cc4cc3S(O)(=O)=O)S(O)(=O)=O)c(O)cc2c1)S(O)(=O)=O |w:21.22,8.8|
Show InChI InChI=1S/C32H24N6O11S3/c33-20-5-10-24-18(11-20)13-26(39)29(32(24)52(47,48)49)37-35-21-6-1-16(2-7-21)17-3-8-22(9-4-17)36-38-30-27(51(44,45)46)14-19-12-23(50(41,42)43)15-25(34)28(19)31(30)40/h1-15,39-40H,33-34H2,(H,41,42,43)(H,44,45,46)(H,47,48,49)
n/an/a 1.26E+3n/an/an/an/an/an/a
The University of Memphis
Curated by ChEMBL
Assay Description
Inhibition of human recombinant C-terminal FLAG-tagged autotaxin expressed in baculovirus-infected Sf9 cells assessed as FS-3 hydrolysis
J Med Chem 53: 3095-105 (2010)
Article DOI: 10.1021/jm901718z
BindingDB Entry DOI: 10.7270/Q2QZ2BXS