BDBM50316190 4-(2-(4-amino-1,2,5-oxadiazol-3-yl)-6-((R)-2-amino-2-phenylethoxy)-1-ethyl-1H-imidazo[4,5-c]pyridin-4-yl)-2-methylbut-3-yn-2-ol::CHEMBL1096634
SMILES: CCn1c(nc2c(nc(OC[C@H](N)c3ccccc3)cc12)C#CC(C)(C)O)-c1nonc1N
InChI Key: InChIKey=NPRGDRYIMFLLIG-HNNXBMFYSA-N
Data: 4 IC50
Activity Spreadsheet -- Enzyme Inhibition Constant Data from BindingDB
Found 4 hits for monomerid = 50316190
Trg + Lig
Ki
nM
ΔG°
kcal/mole
IC50
nM
Kd
nM
EC50/IC50
nM
koff
s-1
kon
M-1s-1
pHTemp
°C
Serine/threonine-protein kinase AKT
(Homo sapiens (Human))
BDBM50316190
(4-(2-(4-amino-1,2,5-oxadiazol-3-yl)-6-((R)-2-amino...)
Show SMILES CCn1c(nc2c(nc(OC[C@H](N)c3ccccc3)cc12)C#CC(C)(C)O)-c1nonc1N |r|
Show InChI InChI=1S/C23H25N7O3/c1-4-30-17-12-18(32-13-15(24)14-8-6-5-7-9-14)26-16(10-11-23(2,3)31)19(17)27-22(30)20-21(25)29-33-28-20/h5-9,12,15,31H,4,13,24H2,1-3H3,(H2,25,29)/t15-/m0/s1
NCI pathway
Reactome pathway
n/an/a 17n/an/an/an/an/an/a
GlaxoSmithKline
Curated by ChEMBL
Assay Description
Inhibition of AKT3
Bioorg Med Chem Lett 19: 1508-11 (2009)
Article DOI: 10.1016/j.bmcl.2009.01.002
BindingDB Entry DOI: 10.7270/Q2XK8FP7
Serine/threonine-protein kinase AKT2
(Homo sapiens (Human))
BDBM50316190
(4-(2-(4-amino-1,2,5-oxadiazol-3-yl)-6-((R)-2-amino...)
Show SMILES CCn1c(nc2c(nc(OC[C@H](N)c3ccccc3)cc12)C#CC(C)(C)O)-c1nonc1N |r|
Show InChI InChI=1S/C23H25N7O3/c1-4-30-17-12-18(32-13-15(24)14-8-6-5-7-9-14)26-16(10-11-23(2,3)31)19(17)27-22(30)20-21(25)29-33-28-20/h5-9,12,15,31H,4,13,24H2,1-3H3,(H2,25,29)/t15-/m0/s1
n/an/a 20n/an/an/an/an/an/a
GlaxoSmithKline
Curated by ChEMBL
Assay Description
Inhibition of AKT2
Bioorg Med Chem Lett 19: 1508-11 (2009)
Article DOI: 10.1016/j.bmcl.2009.01.002
BindingDB Entry DOI: 10.7270/Q2XK8FP7
RAC-alpha serine/threonine-protein kinase
(Homo sapiens (Human))
BDBM50316190
(4-(2-(4-amino-1,2,5-oxadiazol-3-yl)-6-((R)-2-amino...)
Show SMILES CCn1c(nc2c(nc(OC[C@H](N)c3ccccc3)cc12)C#CC(C)(C)O)-c1nonc1N |r|
Show InChI InChI=1S/C23H25N7O3/c1-4-30-17-12-18(32-13-15(24)14-8-6-5-7-9-14)26-16(10-11-23(2,3)31)19(17)27-22(30)20-21(25)29-33-28-20/h5-9,12,15,31H,4,13,24H2,1-3H3,(H2,25,29)/t15-/m0/s1
n/an/a 3n/an/an/an/an/an/a
GlaxoSmithKline
Curated by ChEMBL
Assay Description
Inhibition of AKT
Bioorg Med Chem Lett 19: 1508-11 (2009)
Article DOI: 10.1016/j.bmcl.2009.01.002
BindingDB Entry DOI: 10.7270/Q2XK8FP7
Glycogen synthase kinase-3 beta
(Homo sapiens (Human))
BDBM50316190
(4-(2-(4-amino-1,2,5-oxadiazol-3-yl)-6-((R)-2-amino...)
Show SMILES CCn1c(nc2c(nc(OC[C@H](N)c3ccccc3)cc12)C#CC(C)(C)O)-c1nonc1N |r|
Show InChI InChI=1S/C23H25N7O3/c1-4-30-17-12-18(32-13-15(24)14-8-6-5-7-9-14)26-16(10-11-23(2,3)31)19(17)27-22(30)20-21(25)29-33-28-20/h5-9,12,15,31H,4,13,24H2,1-3H3,(H2,25,29)/t15-/m0/s1
NCI pathway
Reactome pathway
n/an/a 1.11E+3n/an/an/an/an/an/a
GlaxoSmithKline
Curated by ChEMBL
Assay Description
Inhibition of GSK3beta phosphorylation in human BT474 cells
Bioorg Med Chem Lett 19: 1508-11 (2009)
Article DOI: 10.1016/j.bmcl.2009.01.002
BindingDB Entry DOI: 10.7270/Q2XK8FP7