BDBM50316202 6-(2,2-diphenylethylamino)-9-((2R,3R,4S,5S)-5-(ethylcarbamoyl)-3,4-dihydroxytetrahydrofuran-2-yl)-N-(2-(3-(2-(piperidin-1-yl)ethyl)ureido)ethyl)-9H-purine-2-carboxamide::CHEMBL1096886
SMILES: CCNC(=O)[C@H]1O[C@H]([C@H](O)[C@@H]1O)n1cnc2c(NCC(c3ccccc3)c3ccccc3)nc(nc12)C(=O)NCCNC(=O)NCCN1CCCCC1
InChI Key: InChIKey=UCTBCRQNZGCGKA-BBJOTMRQSA-N
Data: 1 IC50
Activity Spreadsheet -- Enzyme Inhibition Constant Data from BindingDB
Found 1 hit for monomerid = 50316202
Trg + Lig
Ki
nM
ΔG°
kcal/mole
IC50
nM
Kd
nM
EC50/IC50
nM
koff
s-1
kon
M-1s-1
pHTemp
°C
Adenosine receptor A2a
(Homo sapiens (Human))
BDBM50316202
(6-(2,2-diphenylethylamino)-9-((2R,3R,4S,5S)-5-(eth...)
Show SMILES CCNC(=O)[C@H]1O[C@H]([C@H](O)[C@@H]1O)n1cnc2c(NCC(c3ccccc3)c3ccccc3)nc(nc12)C(=O)NCCNC(=O)NCCN1CCCCC1 |r|
Show InChI InChI=1S/C37H48N10O6/c1-2-38-34(50)30-28(48)29(49)36(53-30)47-23-43-27-31(42-22-26(24-12-6-3-7-13-24)25-14-8-4-9-15-25)44-32(45-33(27)47)35(51)39-16-17-40-37(52)41-18-21-46-19-10-5-11-20-46/h3-4,6-9,12-15,23,26,28-30,36,48-49H,2,5,10-11,16-22H2,1H3,(H,38,50)(H,39,51)(H2,40,41,52)(H,42,44,45)/t28-,29+,30-,36+/m0/s1
NCI pathway
Reactome pathway
n/an/a 5n/an/an/an/an/an/a
Pfizer Global Research and Development
Curated by ChEMBL
Assay Description
Agonist activity at adenosine A2A receptor in fMLP-stimulated human neutrophils assessed as inhibition of superoxide production by colorimetric analy...
Bioorg Med Chem Lett 19: 4471-5 (2009)
Article DOI: 10.1016/j.bmcl.2009.05.027
BindingDB Entry DOI: 10.7270/Q2ST7Q0C