BDBM50316268 1-{4-[1-(1-benzylpiperidin-4-yl)-4-morpholin-4-yl-1H-pyrazolo[3,4-d]pyrimidin-6-yl]phenyl}-3-[2-(dimethylamino)ethyl]urea::CHEMBL1097898
SMILES: CN(C)CCNC(=O)Nc1ccc(cc1)-c1nc(N2CCOCC2)c2cnn(C3CCN(Cc4ccccc4)CC3)c2n1
InChI Key: InChIKey=QFYNLFVPUYVLEM-UHFFFAOYSA-N
Data: 2 IC50
Activity Spreadsheet -- Enzyme Inhibition Constant Data from BindingDB
Found 2 hits for monomerid = 50316268
Trg + Lig
Ki
nM
ΔG°
kcal/mole
IC50
nM
Kd
nM
EC50/IC50
nM
koff
s-1
kon
M-1s-1
pHTemp
°C
Phosphatidylinositol 4,5-bisphosphate 3-kinase catalytic subunit alpha isoform
(Homo sapiens (Human))
BDBM50316268
(1-{4-[1-(1-benzylpiperidin-4-yl)-4-morpholin-4-yl-...)
Show SMILES CN(C)CCNC(=O)Nc1ccc(cc1)-c1nc(N2CCOCC2)c2cnn(C3CCN(Cc4ccccc4)CC3)c2n1
Show InChI InChI=1S/C32H41N9O2/c1-38(2)17-14-33-32(42)35-26-10-8-25(9-11-26)29-36-30(40-18-20-43-21-19-40)28-22-34-41(31(28)37-29)27-12-15-39(16-13-27)23-24-6-4-3-5-7-24/h3-11,22,27H,12-21,23H2,1-2H3,(H2,33,35,42)
NCI pathway
Reactome pathway
n/an/a 29n/an/an/an/an/an/a
Wyeth Research
Curated by ChEMBL
Assay Description
Inhibition of PI3Kalpha by DELFIA assay
J Med Chem 52: 8010-24 (2009)
Article DOI: 10.1021/jm9013828
BindingDB Entry DOI: 10.7270/Q28W3DGF
Serine/threonine-protein kinase mTOR
(Homo sapiens (Human))
BDBM50316268
(1-{4-[1-(1-benzylpiperidin-4-yl)-4-morpholin-4-yl-...)
Show SMILES CN(C)CCNC(=O)Nc1ccc(cc1)-c1nc(N2CCOCC2)c2cnn(C3CCN(Cc4ccccc4)CC3)c2n1
Show InChI InChI=1S/C32H41N9O2/c1-38(2)17-14-33-32(42)35-26-10-8-25(9-11-26)29-36-30(40-18-20-43-21-19-40)28-22-34-41(31(28)37-29)27-12-15-39(16-13-27)23-24-6-4-3-5-7-24/h3-11,22,27H,12-21,23H2,1-2H3,(H2,33,35,42)
NCI pathway
Reactome pathway
n/an/a 65n/an/an/an/an/an/a
Wyeth Research
Curated by ChEMBL
Assay Description
Inhibition of human mTOR (1360-2549 amino acids) expressed in HEK293 cells
J Med Chem 52: 8010-24 (2009)
Article DOI: 10.1021/jm9013828
BindingDB Entry DOI: 10.7270/Q28W3DGF