BDBM50316309 ((2R,3S,4R,5R)-5-(2-Amino-7-(2-chlorobenzyl)-6-oxo-1Hpurin-1-ium-9(6H)-yl)-3,4-dihydroxytetrahydrofuran-2-yl)methylphosphate::CHEMBL1095941
SMILES: Nc1nc2n(c[n+](Cc3ccccc3Cl)c2c(=O)[nH]1)[C@@H]1O[C@H](COP(O)([O-])=O)[C@@H](O)[C@H]1O
InChI Key: InChIKey=ZUAWTVARTFVXMM-XNIJJKJLSA-N
Data: 1 IC50  1 Kd
Activity Spreadsheet -- Enzyme Inhibition Constant Data from BindingDB
Found 2 hits for monomerid = 50316309
Trg + Lig
Ki
nM
ΔG°
kcal/mole
IC50
nM
Kd
nM
EC50/IC50
nM
koff
s-1
kon
M-1s-1
pHTemp
°C
Eukaryotic translation initiation factor 4E (eIF4E)
(Homo sapiens (Human))
BDBM50316309
(((2R,3S,4R,5R)-5-(2-Amino-7-(2-chlorobenzyl)-6-oxo...)
Show SMILES Nc1nc2n(c[n+](Cc3ccccc3Cl)c2c(=O)[nH]1)[C@@H]1O[C@H](COP(O)([O-])=O)[C@@H](O)[C@H]1O |r|
Show InChI InChI=1S/C17H19ClN5O8P/c18-9-4-2-1-3-8(9)5-22-7-23(14-11(22)15(26)21-17(19)20-14)16-13(25)12(24)10(31-16)6-30-32(27,28)29/h1-4,7,10,12-13,16,24-25H,5-6H2,(H4-,19,20,21,26,27,28,29)/t10-,12-,13-,16-/m1/s1
n/an/a 5.45E+4n/an/an/an/an/an/a
Amgen Inc.
Curated by ChEMBL
Assay Description
Competitive inhibition of [3H]m7-GTP binding to human FLAG-His6 tagged eIF4E expressed in Escherichia coli by scintillation proximity assay
J Med Chem 55: 3837-51 (2012)
Article DOI: 10.1021/jm300037x
BindingDB Entry DOI: 10.7270/Q27082GX
Eukaryotic translation initiation factor 4E
(Mus musculus)
BDBM50316309
(((2R,3S,4R,5R)-5-(2-Amino-7-(2-chlorobenzyl)-6-oxo...)
Show SMILES Nc1nc2n(c[n+](Cc3ccccc3Cl)c2c(=O)[nH]1)[C@@H]1O[C@H](COP(O)([O-])=O)[C@@H](O)[C@H]1O |r|
Show InChI InChI=1S/C17H19ClN5O8P/c18-9-4-2-1-3-8(9)5-22-7-23(14-11(22)15(26)21-17(19)20-14)16-13(25)12(24)10(31-16)6-30-32(27,28)29/h1-4,7,10,12-13,16,24-25H,5-6H2,(H4-,19,20,21,26,27,28,29)/t10-,12-,13-,16-/m1/s1
Reactome pathway
n/an/an/a 2.24E+3n/an/an/an/an/a
University of Minnesota
Curated by ChEMBL
Assay Description
Binding affinity to mouse eIF4E expressed in Escherichia coli by fluorescence time-synchronized titration method in presence of KKRYDREFLLGFQFIFA
Eur J Med Chem 45: 1304-13 (2010)
Article DOI: 10.1016/j.ejmech.2009.11.054
BindingDB Entry DOI: 10.7270/Q21C1X1Q