null
SMILES: CCCCCCCCCCOc1ccc(cc1)N1CCN(CC1)C(=O)c1ccc(Cc2nc(=O)o[nH]2)cc1
InChI Key: InChIKey=AIDBAKYBXFGRNB-UHFFFAOYSA-N
Activity Spreadsheet -- Enzyme Inhibition Constant Data from BindingDB
Found 2 hits for monomerid = 50316460
Trg + Lig
Ki
nM
ΔG°
kcal/mole
IC50
nM
Kd
nM
EC50/IC50
nM
koff
s-1
kon
M-1s-1
pHTemp
°C
Phospholipase A2, membrane associated
(Homo sapiens (Human))
BDBM50316460
(1-[4-(4,5-Dihydro-1,2,4-(4H)-5-oxo-oxadiazol-3-ylm...)
Show SMILES CCCCCCCCCCOc1ccc(cc1)N1CCN(CC1)C(=O)c1ccc(Cc2nc(=O)o[nH]2)cc1
Show InChI InChI=1S/C30H40N4O4/c1-2-3-4-5-6-7-8-9-22-37-27-16-14-26(15-17-27)33-18-20-34(21-19-33)29(35)25-12-10-24(11-13-25)23-28-31-30(36)38-32-28/h10-17H,2-9,18-23H2,1H3,(H,31,32,36)
NCI pathway
Reactome pathway
n/an/a 3.25E+3n/an/an/an/an/an/a
Universit£ Paris Diderot
Curated by ChEMBL
Assay Description
Inhibition of human recombinant group 2A phospholipase A2 by fluorimetric assay
Bioorg Med Chem 18: 3588-600 (2010)
Article DOI: 10.1016/j.bmc.2010.03.049
BindingDB Entry DOI: 10.7270/Q2ZG6SD9
Phospholipase A2, major isoenzyme
(Sus scrofa (pig))
BDBM50316460
(1-[4-(4,5-Dihydro-1,2,4-(4H)-5-oxo-oxadiazol-3-ylm...)
Show SMILES CCCCCCCCCCOc1ccc(cc1)N1CCN(CC1)C(=O)c1ccc(Cc2nc(=O)o[nH]2)cc1
Show InChI InChI=1S/C30H40N4O4/c1-2-3-4-5-6-7-8-9-22-37-27-16-14-26(15-17-27)33-18-20-34(21-19-33)29(35)25-12-10-24(11-13-25)23-28-31-30(36)38-32-28/h10-17H,2-9,18-23H2,1H3,(H,31,32,36)
n/an/a 2.16E+4n/an/an/an/an/an/a
Universit£ Paris Diderot
Curated by ChEMBL
Assay Description
Inhibition of porcine group 1B phospholipase A2 by fluorimetric assay
Bioorg Med Chem 18: 3588-600 (2010)
Article DOI: 10.1016/j.bmc.2010.03.049
BindingDB Entry DOI: 10.7270/Q2ZG6SD9