BDBM50316482 4-[1-Ethyl-3-(4-{[(phenylamino)carbonyl]amino}phenyl)-1Hpyrazol-4-yl]-N-[3-(4-methyl-1-piperazinyl)propyl]-1H-pyrrolo-[2,3-b]pyridine-2-carboxamide::CHEMBL1094705
SMILES: CCn1cc(c(n1)-c1ccc(NC(=O)Nc2ccccc2)cc1)-c1ccnc2[nH]c(cc12)C(=O)NCCCN1CCN(C)CC1
InChI Key: InChIKey=OPSVHJZYWJYWSU-UHFFFAOYSA-N
Data: 2 IC50
Activity Spreadsheet -- Enzyme Inhibition Constant Data from BindingDB
Found 2 hits for monomerid = 50316482
Trg + Lig
Ki
nM
ΔG°
kcal/mole
IC50
nM
Kd
nM
EC50/IC50
nM
koff
s-1
kon
M-1s-1
pHTemp
°C
Aurora kinase A
(Homo sapiens (Human))
BDBM50316482
(4-[1-Ethyl-3-(4-{[(phenylamino)carbonyl]amino}phen...)
Show SMILES CCn1cc(c(n1)-c1ccc(NC(=O)Nc2ccccc2)cc1)-c1ccnc2[nH]c(cc12)C(=O)NCCCN1CCN(C)CC1
Show InChI InChI=1S/C34H39N9O2/c1-3-43-23-29(31(40-43)24-10-12-26(13-11-24)38-34(45)37-25-8-5-4-6-9-25)27-14-16-35-32-28(27)22-30(39-32)33(44)36-15-7-17-42-20-18-41(2)19-21-42/h4-6,8-14,16,22-23H,3,7,15,17-21H2,1-2H3,(H,35,39)(H,36,44)(H2,37,38,45)
NCI pathway
Reactome pathway
n/an/a 228n/an/an/an/an/an/a
GlaxoSmithKline
Curated by ChEMBL
Assay Description
Inhibition of human Aurora A
J Med Chem 53: 3973-4001 (2010)
Article DOI: 10.1021/jm901870q
BindingDB Entry DOI: 10.7270/Q27082CK
Aurora kinase B
(Homo sapiens (Human))
BDBM50316482
(4-[1-Ethyl-3-(4-{[(phenylamino)carbonyl]amino}phen...)
Show SMILES CCn1cc(c(n1)-c1ccc(NC(=O)Nc2ccccc2)cc1)-c1ccnc2[nH]c(cc12)C(=O)NCCCN1CCN(C)CC1
Show InChI InChI=1S/C34H39N9O2/c1-3-43-23-29(31(40-43)24-10-12-26(13-11-24)38-34(45)37-25-8-5-4-6-9-25)27-14-16-35-32-28(27)22-30(39-32)33(44)36-15-7-17-42-20-18-41(2)19-21-42/h4-6,8-14,16,22-23H,3,7,15,17-21H2,1-2H3,(H,35,39)(H,36,44)(H2,37,38,45)
Reactome pathway
n/an/a 8n/an/an/an/an/an/a
GlaxoSmithKline
Curated by ChEMBL
Assay Description
Inhibition of human Aurora B by rapid dilution method
J Med Chem 53: 3973-4001 (2010)
Article DOI: 10.1021/jm901870q
BindingDB Entry DOI: 10.7270/Q27082CK