BDBM50316519 CHEMBL1097456::N-[6-(4-CHLOROPHENYL)-7-(2,4-DICHLOROPHENYL)-2,2-DIMETHYL-3,4-DIHYDRO-2H-PYRANO[2,3-B]PYRIDINE-4-YL]-4,4,4-TRIFLUORO-3-HYDROXYBUTANAMIDE (DIASTEREOMERIC MIX)::N-[6-(4-Chlorophenyl)-7-(2,4-dichlorophenyl)-2,2-dimethyl-3,4-dihydro-2H-pyrano[2,3-b]pyridine-4-yl]-4,4,4-trifluoro-3-hydroxybutanamide
SMILES: CC1(C)CC(NC(=O)CC(O)C(F)(F)F)c2cc(-c3ccc(Cl)cc3)c(nc2O1)-c1ccc(Cl)cc1Cl
InChI Key: InChIKey=ONIULYGRFWGEHO-UHFFFAOYSA-N
Data: 3 IC50
Activity Spreadsheet -- Enzyme Inhibition Constant Data from BindingDB
Found 3 hits for monomerid = 50316519
Trg + Lig
Ki
nM
ΔG°
kcal/mole
IC50
nM
Kd
nM
EC50/IC50
nM
koff
s-1
kon
M-1s-1
pHTemp
°C
Cannabinoid receptor 1
(Homo sapiens (Human))
BDBM50316519
(CHEMBL1097456 | N-[6-(4-CHLOROPHENYL)-7-(2,4-DICHL...)
Show SMILES CC1(C)CC(NC(=O)CC(O)C(F)(F)F)c2cc(-c3ccc(Cl)cc3)c(nc2O1)-c1ccc(Cl)cc1Cl
Show InChI InChI=1S/C26H22Cl3F3N2O3/c1-25(2)12-20(33-22(36)11-21(35)26(30,31)32)18-10-17(13-3-5-14(27)6-4-13)23(34-24(18)37-25)16-8-7-15(28)9-19(16)29/h3-10,20-21,35H,11-12H2,1-2H3,(H,33,36)
NCI pathway
Reactome pathway
n/an/a 0.700n/an/an/an/an/an/a
Merck Research Laboratories
Curated by ChEMBL
Assay Description
Displacement of [3H]CP55940 from human recombinant cannabinoid CB1 receptor expressed in CHO cells
J Med Chem 53: 4028-37 (2010)
Article DOI: 10.1021/jm100023j
BindingDB Entry DOI: 10.7270/Q2TQ61QD
Potassium voltage-gated channel subfamily H member 2
(Homo sapiens (Human))
BDBM50316519
(CHEMBL1097456 | N-[6-(4-CHLOROPHENYL)-7-(2,4-DICHL...)
Show SMILES CC1(C)CC(NC(=O)CC(O)C(F)(F)F)c2cc(-c3ccc(Cl)cc3)c(nc2O1)-c1ccc(Cl)cc1Cl
Show InChI InChI=1S/C26H22Cl3F3N2O3/c1-25(2)12-20(33-22(36)11-21(35)26(30,31)32)18-10-17(13-3-5-14(27)6-4-13)23(34-24(18)37-25)16-8-7-15(28)9-19(16)29/h3-10,20-21,35H,11-12H2,1-2H3,(H,33,36)
Reactome pathway
n/an/a 1.46E+3n/an/an/an/an/an/a
Merck Research Laboratories
Curated by ChEMBL
Assay Description
Displacement of [35S]MK499 from human ERG expressed in HEK293 cells
J Med Chem 53: 4028-37 (2010)
Article DOI: 10.1021/jm100023j
BindingDB Entry DOI: 10.7270/Q2TQ61QD
Cannabinoid receptor 2
(Homo sapiens (Human))
BDBM50316519
(CHEMBL1097456 | N-[6-(4-CHLOROPHENYL)-7-(2,4-DICHL...)
Show SMILES CC1(C)CC(NC(=O)CC(O)C(F)(F)F)c2cc(-c3ccc(Cl)cc3)c(nc2O1)-c1ccc(Cl)cc1Cl
Show InChI InChI=1S/C26H22Cl3F3N2O3/c1-25(2)12-20(33-22(36)11-21(35)26(30,31)32)18-10-17(13-3-5-14(27)6-4-13)23(34-24(18)37-25)16-8-7-15(28)9-19(16)29/h3-10,20-21,35H,11-12H2,1-2H3,(H,33,36)
Reactome pathway
n/an/a 250n/an/an/an/an/an/a
Merck Research Laboratories
Curated by ChEMBL
Assay Description
Displacement of [3H]CP55940 from human recombinant cannabinoid CB2 receptor expressed in CHO cells
J Med Chem 53: 4028-37 (2010)
Article DOI: 10.1021/jm100023j
BindingDB Entry DOI: 10.7270/Q2TQ61QD