null
SMILES: COC1=C(OC)[C@]23CCc4ccc(OC)c(O)c4[C@]2(CC(=O)N3C)CC1=O
InChI Key: InChIKey=CLWJGNIITFMBQR-WOJBJXKFSA-N
Activity Spreadsheet -- Enzyme Inhibition Constant Data from BindingDB
Found 1 hit for monomerid = 50316550
Trg + Lig
Ki
nM
ΔG°
kcal/mole
IC50
nM
Kd
nM
EC50/IC50
nM
koff
s-1
kon
M-1s-1
pHTemp
°C
Delta-type opioid receptor
(Homo sapiens (Human))
BDBM50316550
(CHEMBL1097185 | aknadilactam)
Show SMILES COC1=C(OC)[C@]23CCc4ccc(OC)c(O)c4[C@]2(CC(=O)N3C)CC1=O |r,c:2|
Show InChI InChI=1S/C20H23NO6/c1-21-14(23)10-19-9-12(22)17(26-3)18(27-4)20(19,21)8-7-11-5-6-13(25-2)16(24)15(11)19/h5-6,24H,7-10H2,1-4H3/t19-,20-/m1/s1
Reactome pathway
n/an/a 1.70E+4n/an/an/an/an/an/a
Griffith University
Curated by ChEMBL
Assay Description
Displacement of [3H]deltorphin-2 from human delta opioid receptor expressed in HEK293 cell membrane
J Nat Prod 73: 988-91 (2010)
Article DOI: 10.1021/np100009j
BindingDB Entry DOI: 10.7270/Q2FF3SHH