BDBM50316551 CHEMBL1096481::N-methylstephuline
SMILES: CO[C@H]1[C@@H](O)C[C@]23CCN(C)[C@@]22C[C@H](O[C@]12OC)c1ccc(OC)c(O)c31
InChI Key: InChIKey=GAUBYMMEBUOLGW-HMOIBATMSA-N
Data: 1 IC50
Activity Spreadsheet -- Enzyme Inhibition Constant Data from BindingDB
Found 1 hit for monomerid = 50316551
Trg + Lig
Ki
nM
ΔG°
kcal/mole
IC50
nM
Kd
nM
EC50/IC50
nM
koff
s-1
kon
M-1s-1
pHTemp
°C
Delta-type opioid receptor
(Homo sapiens (Human))
BDBM50316551
(CHEMBL1096481 | N-methylstephuline)
Show SMILES CO[C@H]1[C@@H](O)C[C@]23CCN(C)[C@@]22C[C@H](O[C@]12OC)c1ccc(OC)c(O)c31 |r|
Show InChI InChI=1S/C20H27NO6/c1-21-8-7-18-9-12(22)17(25-3)20(26-4)19(18,21)10-14(27-20)11-5-6-13(24-2)16(23)15(11)18/h5-6,12,14,17,22-23H,7-10H2,1-4H3/t12-,14-,17-,18-,19-,20+/m0/s1
Reactome pathway
n/an/a 2.10E+3n/an/an/an/an/an/a
Griffith University
Curated by ChEMBL
Assay Description
Displacement of [3H]deltorphin-2 from human delta opioid receptor expressed in HEK293 cell membrane
J Nat Prod 73: 988-91 (2010)
Article DOI: 10.1021/np100009j
BindingDB Entry DOI: 10.7270/Q2FF3SHH