null
SMILES: CCCN(CCC)C(=O)C(=O)c1c([nH]c2ccc(cc12)N=C=S)-c1ccccc1
InChI Key: InChIKey=KVVHMNWUPDMNJO-UHFFFAOYSA-N
Activity Spreadsheet -- Enzyme Inhibition Constant Data from BindingDB
Found 3 hits for monomerid = 50316600
Trg + Lig
Ki
nM
ΔG°
kcal/mole
IC50
nM
Kd
nM
EC50/IC50
nM
koff
s-1
kon
M-1s-1
pHTemp
°C
Translocator protein
(Rattus norvegicus (rat))
BDBM50316600
(CHEMBL1097176 | N,N-Dipropyl-[5-isothiocyanato-2-p...)
Show SMILES CCCN(CCC)C(=O)C(=O)c1c([nH]c2ccc(cc12)N=C=S)-c1ccccc1
Show InChI InChI=1S/C23H23N3O2S/c1-3-12-26(13-4-2)23(28)22(27)20-18-14-17(24-15-29)10-11-19(18)25-21(20)16-8-6-5-7-9-16/h5-11,14,25H,3-4,12-13H2,1-2H3
37.9n/an/an/an/an/an/an/an/a
Universit£ di Pisa
Curated by ChEMBL
Assay Description
Displacement of [3H]Ro5-4864 from TSPO in rat kidney mitochondrial membrane
J Med Chem 53: 4085-93 (2010)
Article DOI: 10.1021/jm100100q
BindingDB Entry DOI: 10.7270/Q2XG9R9C
Translocator protein
(Rattus norvegicus (rat))
BDBM50316600
(CHEMBL1097176 | N,N-Dipropyl-[5-isothiocyanato-2-p...)
Show SMILES CCCN(CCC)C(=O)C(=O)c1c([nH]c2ccc(cc12)N=C=S)-c1ccccc1
Show InChI InChI=1S/C23H23N3O2S/c1-3-12-26(13-4-2)23(28)22(27)20-18-14-17(24-15-29)10-11-19(18)25-21(20)16-8-6-5-7-9-16/h5-11,14,25H,3-4,12-13H2,1-2H3
n/an/an/a 3.17n/an/an/an/an/a
Universit£ di Pisa
Curated by ChEMBL
Assay Description
Irreversible binding affinity to TSPO in rat kidney mitochondrial membrane
J Med Chem 53: 4085-93 (2010)
Article DOI: 10.1021/jm100100q
BindingDB Entry DOI: 10.7270/Q2XG9R9C
Translocator protein
(Rattus norvegicus (rat))
BDBM50316600
(CHEMBL1097176 | N,N-Dipropyl-[5-isothiocyanato-2-p...)
Show SMILES CCCN(CCC)C(=O)C(=O)c1c([nH]c2ccc(cc12)N=C=S)-c1ccccc1
Show InChI InChI=1S/C23H23N3O2S/c1-3-12-26(13-4-2)23(28)22(27)20-18-14-17(24-15-29)10-11-19(18)25-21(20)16-8-6-5-7-9-16/h5-11,14,25H,3-4,12-13H2,1-2H3
n/an/a 45.6n/an/an/an/an/an/a
Universit£ di Pisa
Curated by ChEMBL
Assay Description
Displacement of [3H]Ro5-4864 from TSPO in rat kidney mitochondrial membrane
J Med Chem 53: 4085-93 (2010)
Article DOI: 10.1021/jm100100q
BindingDB Entry DOI: 10.7270/Q2XG9R9C