BDBM50316643 1-(1-(2-ethoxyethyl)-3-methyl-7-(4-methylpyridin-2-ylamino)-1H-pyrazolo[4,3-d]pyrimidin-5-yl)piperidine-4-carboxamide::CHEMBL1097822
SMILES: CCOCCn1nc(C)c2nc(nc(Nc3cc(C)ccn3)c12)N1CCC(CC1)C(N)=O
InChI Key: InChIKey=FACLOOSIUCBIPK-UHFFFAOYSA-N
Data: 1 IC50
Activity Spreadsheet -- Enzyme Inhibition Constant Data from BindingDB
Found 1 hit for monomerid = 50316643
Trg + Lig
Ki
nM
ΔG°
kcal/mole
IC50
nM
Kd
nM
EC50/IC50
nM
koff
s-1
kon
M-1s-1
pHTemp
°C
cGMP-specific 3',5'-cyclic phosphodiesterase
(Homo sapiens (Human))
BDBM50316643
(1-(1-(2-ethoxyethyl)-3-methyl-7-(4-methylpyridin-2...)
Show SMILES CCOCCn1nc(C)c2nc(nc(Nc3cc(C)ccn3)c12)N1CCC(CC1)C(N)=O
Show InChI InChI=1S/C22H30N8O2/c1-4-32-12-11-30-19-18(15(3)28-30)26-22(29-9-6-16(7-10-29)20(23)31)27-21(19)25-17-13-14(2)5-8-24-17/h5,8,13,16H,4,6-7,9-12H2,1-3H3,(H2,23,31)(H,24,25,26,27)
Reactome pathway
n/an/a 0.190n/an/an/an/an/an/a
Pfizer Global Research and Development
Curated by ChEMBL
Assay Description
Inhibition of PDE5 in human platelet by assessed as hydrolysis of [3H]cGMP scintillation proximity assay
Bioorg Med Chem Lett 20: 3120-4 (2010)
BindingDB Entry DOI: 10.7270/Q2K64K0H