BDBM50316647 1-(1-(2-ethoxyethyl)-3-ethyl-7-(4-methylpyridin-2-ylamino)-1H-pyrazolo[4,3-d]pyrimidin-5-yl)piperidine-4-carboxylic acid::CHEMBL1094365
SMILES: CCOCCn1nc(CC)c2nc(nc(Nc3cc(C)ccn3)c12)N1CCC(CC1)C(O)=O
InChI Key: InChIKey=IQZQWPRZFLHJFI-UHFFFAOYSA-N
Data: 2 IC50
Activity Spreadsheet -- Enzyme Inhibition Constant Data from BindingDB
Found 2 hits for monomerid = 50316647
Trg + Lig
Ki
nM
ΔG°
kcal/mole
IC50
nM
Kd
nM
EC50/IC50
nM
koff
s-1
kon
M-1s-1
pHTemp
°C
Potassium voltage-gated channel subfamily H member 2
(Homo sapiens (Human))
BDBM50316647
(1-(1-(2-ethoxyethyl)-3-ethyl-7-(4-methylpyridin-2-...)
Show SMILES CCOCCn1nc(CC)c2nc(nc(Nc3cc(C)ccn3)c12)N1CCC(CC1)C(O)=O
Show InChI InChI=1S/C23H31N7O3/c1-4-17-19-20(30(28-17)12-13-33-5-2)21(25-18-14-15(3)6-9-24-18)27-23(26-19)29-10-7-16(8-11-29)22(31)32/h6,9,14,16H,4-5,7-8,10-13H2,1-3H3,(H,31,32)(H,24,25,26,27)
Reactome pathway
n/an/a 1.10E+3n/an/an/an/an/an/a
Pfizer Global Research and Development
Curated by ChEMBL
Assay Description
Inhibition of human ERG by patch clamp electrophisiology
Bioorg Med Chem Lett 20: 3120-4 (2010)
BindingDB Entry DOI: 10.7270/Q2K64K0H
cGMP-specific 3',5'-cyclic phosphodiesterase
(Homo sapiens (Human))
BDBM50316647
(1-(1-(2-ethoxyethyl)-3-ethyl-7-(4-methylpyridin-2-...)
Show SMILES CCOCCn1nc(CC)c2nc(nc(Nc3cc(C)ccn3)c12)N1CCC(CC1)C(O)=O
Show InChI InChI=1S/C23H31N7O3/c1-4-17-19-20(30(28-17)12-13-33-5-2)21(25-18-14-15(3)6-9-24-18)27-23(26-19)29-10-7-16(8-11-29)22(31)32/h6,9,14,16H,4-5,7-8,10-13H2,1-3H3,(H,31,32)(H,24,25,26,27)
Reactome pathway
n/an/a 0.0400n/an/an/an/an/an/a
Pfizer Global Research and Development
Curated by ChEMBL
Assay Description
Inhibition of PDE5 in human platelet by assessed as hydrolysis of [3H]cGMP scintillation proximity assay
Bioorg Med Chem Lett 20: 3120-4 (2010)
BindingDB Entry DOI: 10.7270/Q2K64K0H