BDBM50316654 1-(2-ethoxyethyl)-3-methyl-N-(4-methylpyridin-2-yl)-5-(piperazin-1-yl)-1H-pyrazolo[4,3-d]pyrimidin-7-amine::CHEMBL1095185
SMILES: CCOCCn1nc(C)c2nc(nc(Nc3cc(C)ccn3)c12)N1CCNCC1
InChI Key: InChIKey=COIONXOQVKNMPQ-UHFFFAOYSA-N
Data: 1 IC50
Activity Spreadsheet -- Enzyme Inhibition Constant Data from BindingDB
Found 1 hit for monomerid = 50316654
Trg + Lig
Ki
nM
ΔG°
kcal/mole
IC50
nM
Kd
nM
EC50/IC50
nM
koff
s-1
kon
M-1s-1
pHTemp
°C
cGMP-specific 3',5'-cyclic phosphodiesterase
(Homo sapiens (Human))
BDBM50316654
(1-(2-ethoxyethyl)-3-methyl-N-(4-methylpyridin-2-yl...)
Show SMILES CCOCCn1nc(C)c2nc(nc(Nc3cc(C)ccn3)c12)N1CCNCC1
Show InChI InChI=1S/C20H28N8O/c1-4-29-12-11-28-18-17(15(3)26-28)24-20(27-9-7-21-8-10-27)25-19(18)23-16-13-14(2)5-6-22-16/h5-6,13,21H,4,7-12H2,1-3H3,(H,22,23,24,25)
Reactome pathway
n/an/a 1.40n/an/an/an/an/an/a
Pfizer Global Research and Development
Curated by ChEMBL
Assay Description
Inhibition of PDE5 in human platelet by assessed as hydrolysis of [3H]cGMP scintillation proximity assay
Bioorg Med Chem Lett 20: 3120-4 (2010)
BindingDB Entry DOI: 10.7270/Q2K64K0H