BDBM50316684 3,5-Difluoro-8-{4-[4-(6-methoxyquinolin-8-yl)piperazin-1-yl]piperidin-1-yl}quinoline::CHEMBL1098134
SMILES: COc1cc(N2CCN(CC2)C2CCN(CC2)c2ccc(F)c3cc(F)cnc23)c2ncccc2c1
InChI Key: InChIKey=VTIKCSNWLLZXHI-UHFFFAOYSA-N
Data: 1 KI  1 IC50
Activity Spreadsheet -- Enzyme Inhibition Constant Data from BindingDB
Found 2 hits for monomerid = 50316684
Trg + Lig
Ki
nM
ΔG°
kcal/mole
IC50
nM
Kd
nM
EC50/IC50
nM
koff
s-1
kon
M-1s-1
pHTemp
°C
5-hydroxytryptamine receptor 1A
(Homo sapiens (Human))
BDBM50316684
(3,5-Difluoro-8-{4-[4-(6-methoxyquinolin-8-yl)piper...)
Show SMILES COc1cc(N2CCN(CC2)C2CCN(CC2)c2ccc(F)c3cc(F)cnc23)c2ncccc2c1
Show InChI InChI=1S/C28H29F2N5O/c1-36-22-15-19-3-2-8-31-27(19)26(17-22)35-13-11-33(12-14-35)21-6-9-34(10-7-21)25-5-4-24(30)23-16-20(29)18-32-28(23)25/h2-5,8,15-18,21H,6-7,9-14H2,1H3
0.470n/an/an/an/an/an/an/an/a
Pfizer Global Research and Development
Curated by ChEMBL
Assay Description
Displacement of [3H]8-OH-DPAT from human 5HT1A receptor expressed in CHO cells
J Med Chem 53: 4066-84 (2010)
Article DOI: 10.1021/jm1000908
BindingDB Entry DOI: 10.7270/Q28P60P7
5-hydroxytryptamine receptor 1A
(Homo sapiens (Human))
BDBM50316684
(3,5-Difluoro-8-{4-[4-(6-methoxyquinolin-8-yl)piper...)
Show SMILES COc1cc(N2CCN(CC2)C2CCN(CC2)c2ccc(F)c3cc(F)cnc23)c2ncccc2c1
Show InChI InChI=1S/C28H29F2N5O/c1-36-22-15-19-3-2-8-31-27(19)26(17-22)35-13-11-33(12-14-35)21-6-9-34(10-7-21)25-5-4-24(30)23-16-20(29)18-32-28(23)25/h2-5,8,15-18,21H,6-7,9-14H2,1H3
n/an/a 20n/an/an/an/an/an/a
Pfizer Global Research and Development
Curated by ChEMBL
Assay Description
Antagonist activity at human 5HT1A receptor expressed in CHO cells assessed as blockade of 8-OH-DPAT-induced inhibition of forskolin-stimulated incre...
J Med Chem 53: 4066-84 (2010)
Article DOI: 10.1021/jm1000908
BindingDB Entry DOI: 10.7270/Q28P60P7