BDBM50316690 8-{4-[4-(6-Methoxyquinolin-8-yl)piperazin-1-yl]piperidin-1-yl}-4-methylquinoline::CHEMBL1094558
SMILES: COc1cc(N2CCN(CC2)C2CCN(CC2)c2cccc3c(C)ccnc23)c2ncccc2c1
InChI Key: InChIKey=AZWXAFUKSVZQEG-UHFFFAOYSA-N
Data: 1 KI  1 IC50
Activity Spreadsheet -- Enzyme Inhibition Constant Data from BindingDB
Found 2 hits for monomerid = 50316690
Trg + Lig
Ki
nM
ΔG°
kcal/mole
IC50
nM
Kd
nM
EC50/IC50
nM
koff
s-1
kon
M-1s-1
pHTemp
°C
5-hydroxytryptamine receptor 1A
(Homo sapiens (Human))
BDBM50316690
(8-{4-[4-(6-Methoxyquinolin-8-yl)piperazin-1-yl]pip...)
Show SMILES COc1cc(N2CCN(CC2)C2CCN(CC2)c2cccc3c(C)ccnc23)c2ncccc2c1
Show InChI InChI=1S/C29H33N5O/c1-21-8-12-31-29-25(21)6-3-7-26(29)33-13-9-23(10-14-33)32-15-17-34(18-16-32)27-20-24(35-2)19-22-5-4-11-30-28(22)27/h3-8,11-12,19-20,23H,9-10,13-18H2,1-2H3
0.610n/an/an/an/an/an/an/an/a
Pfizer Global Research and Development
Curated by ChEMBL
Assay Description
Displacement of [3H]8-OH-DPAT from human 5HT1A receptor expressed in CHO cells
J Med Chem 53: 4066-84 (2010)
Article DOI: 10.1021/jm1000908
BindingDB Entry DOI: 10.7270/Q28P60P7
5-hydroxytryptamine receptor 1A
(Homo sapiens (Human))
BDBM50316690
(8-{4-[4-(6-Methoxyquinolin-8-yl)piperazin-1-yl]pip...)
Show SMILES COc1cc(N2CCN(CC2)C2CCN(CC2)c2cccc3c(C)ccnc23)c2ncccc2c1
Show InChI InChI=1S/C29H33N5O/c1-21-8-12-31-29-25(21)6-3-7-26(29)33-13-9-23(10-14-33)32-15-17-34(18-16-32)27-20-24(35-2)19-22-5-4-11-30-28(22)27/h3-8,11-12,19-20,23H,9-10,13-18H2,1-2H3
n/an/a 1.40n/an/an/an/an/an/a
Pfizer Global Research and Development
Curated by ChEMBL
Assay Description
Antagonist activity at human 5HT1A receptor expressed in CHO cells assessed as blockade of 8-OH-DPAT-induced inhibition of forskolin-stimulated incre...
J Med Chem 53: 4066-84 (2010)
Article DOI: 10.1021/jm1000908
BindingDB Entry DOI: 10.7270/Q28P60P7