BDBM50316713 (Z,Z)-2-Isopropylimino-5-(2-methoxy-benzylidene)-3-phenyl-thiazolidin-4-one::CHEMBL1097528
SMILES: COc1ccccc1\C=C1/S\C(=N/C(C)C)N(C1=O)c1ccccc1
InChI Key: InChIKey=ZZTHFLGPODYQEZ-PQDITWEDSA-N
Data: 2 EC50
Activity Spreadsheet -- Enzyme Inhibition Constant Data from BindingDB
Found 2 hits for monomerid = 50316713
Trg + Lig
Ki
nM
ΔG°
kcal/mole
IC50
nM
Kd
nM
EC50/IC50
nM
koff
s-1
kon
M-1s-1
pHTemp
°C
Sphingosine 1-phosphate receptor 1
(Homo sapiens (Human))
BDBM50316713
((Z,Z)-2-Isopropylimino-5-(2-methoxy-benzylidene)-3...)
Show SMILES COc1ccccc1\C=C1/S\C(=N/C(C)C)N(C1=O)c1ccccc1
Show InChI InChI=1S/C20H20N2O2S/c1-14(2)21-20-22(16-10-5-4-6-11-16)19(23)18(25-20)13-15-9-7-8-12-17(15)24-3/h4-14H,1-3H3/b18-13-,21-20-
Reactome pathway
n/an/an/an/a>1.00E+4n/an/an/an/a
Actelion Pharmaceuticals Ltd.
Curated by ChEMBL
Assay Description
Agonist activity at human recombinant S1P1 receptor expressed in CHO cells by GTPgammaS binding assay
J Med Chem 53: 4198-211 (2010)
Article DOI: 10.1021/jm100181s
BindingDB Entry DOI: 10.7270/Q2513ZBQ
Sphingosine 1-phosphate receptor 3
(Homo sapiens (Human))
BDBM50316713
((Z,Z)-2-Isopropylimino-5-(2-methoxy-benzylidene)-3...)
Show SMILES COc1ccccc1\C=C1/S\C(=N/C(C)C)N(C1=O)c1ccccc1
Show InChI InChI=1S/C20H20N2O2S/c1-14(2)21-20-22(16-10-5-4-6-11-16)19(23)18(25-20)13-15-9-7-8-12-17(15)24-3/h4-14H,1-3H3/b18-13-,21-20-
NCI pathway
Reactome pathway
n/an/an/an/a 6.69E+3n/an/an/an/a
Actelion Pharmaceuticals Ltd.
Curated by ChEMBL
Assay Description
Agonist activity at human recombinant S1P3 receptor expressed in CHO cells by GTPgammaS binding assay
J Med Chem 53: 4198-211 (2010)
Article DOI: 10.1021/jm100181s
BindingDB Entry DOI: 10.7270/Q2513ZBQ